{"text_format":"1","workbook":"xlsx","n_sheets":4,"sheets":["INPUT NOTA","CETAK NOTA","REKAP BARANG","PRICELIST"],"not_rendered":{"charts":0,"images":0,"macros":1,"external_links":0,"defined_names":3,"comments":0,"pivot_tables":0},"unopened":[],"bounds":{"document_bytes":16777216,"sheet_cells":100000,"rows_first":2000,"rows_last":500,"rows_between":2000,"halvings":0,"cell_chars":16384,"cell_head_chars":4096},"cells_cut":0,"cells_raw":0,"read":"whole","date_system":"1900"}

{"sheet":"INPUT NOTA","index":0,"n_rows":23,"n_cols":7,"rows_kept":23,"cut":false,"hidden":false,"merged":[[1,1,2,1],[1,2,2,3],[23,2,23,3],[1,4,1,5],[2,4,2,5],[4,2,4,3],[21,4,21,5]]}
[3,null,"NO ="]
[null,"NOTA KONTAN",null,null,"Kepada Yth =",null,{"$f":"IF(ISERROR(VLOOKUP(D1,tagname,2,FALSE)),\"\",VLOOKUP(D1,tagname,2,FALSE))","v":""}]
[null,null,null,null,"ALAMAT =",null,{"$f":"IF(ISERROR(VLOOKUP(D1,tagname,3,FALSE)),\"\",VLOOKUP(D1,tagname,3,FALSE))","v":""}]
[]
["CODE","NAMA BARANG","QUANTITY",null,"HARGA","DISC","SUB TOTAL"]
[null,{"$f":"IF(ISERROR(VLOOKUP(A6,CODE,2,FALSE)),\"\",(VLOOKUP(A6,CODE,2,FALSE)))","v":""},null,{"$f":"IF(ISERROR(VLOOKUP(A6,CODE,5,FALSE)),\"\",(VLOOKUP(A6,CODE,5,FALSE)))","v":""},{"$f":"IF(ISERROR(VLOOKUP(A6,CODE,IF(D6=\"PCS\",7,IF(D6=\"LTR\",7,4)),FALSE)),\"\",VLOOKUP(A6,CODE,IF(D6=\"PCS\",7,IF(D6=\"LTR\",7,4)),FALSE))","v":""},null,{"$f":"IF(ISERROR((C6*E6)-(C6*E6)*F6),\"\",((C6*E6)-(C6*E6)*F6))","v":""}]
[null,"",null,{"$f":"IF(ISERROR(VLOOKUP(A7,CODE,5,FALSE)),\"\",(VLOOKUP(A7,CODE,5,FALSE)))","v":""},{"$f":"IF(ISERROR(VLOOKUP(A7,CODE,IF(D7=\"PCS\",7,IF(D7=\"LTR\",7,4)),FALSE)),\"\",VLOOKUP(A7,CODE,IF(D7=\"PCS\",7,IF(D7=\"LTR\",7,4)),FALSE))","v":""},null,{"$f":"IF(ISERROR((C7*E7)-(C7*E7)*F7),\"\",((C7*E7)-(C7*E7)*F7))","v":""}]
[null,"",null,{"$f":"IF(ISERROR(VLOOKUP(A8,CODE,5,FALSE)),\"\",(VLOOKUP(A8,CODE,5,FALSE)))","v":""},{"$f":"IF(ISERROR(VLOOKUP(A8,CODE,IF(D8=\"PCS\",7,IF(D8=\"LTR\",7,4)),FALSE)),\"\",VLOOKUP(A8,CODE,IF(D8=\"PCS\",7,IF(D8=\"LTR\",7,4)),FALSE))","v":""},null,{"$f":"IF(ISERROR((C8*E8)-(C8*E8)*F8),\"\",((C8*E8)-(C8*E8)*F8))","v":""}]
[null,"",null,{"$f":"IF(ISERROR(VLOOKUP(A9,CODE,5,FALSE)),\"\",(VLOOKUP(A9,CODE,5,FALSE)))","v":""},{"$f":"IF(ISERROR(VLOOKUP(A9,CODE,IF(D9=\"PCS\",7,IF(D9=\"LTR\",7,4)),FALSE)),\"\",VLOOKUP(A9,CODE,IF(D9=\"PCS\",7,IF(D9=\"LTR\",7,4)),FALSE))","v":""},null,""]
[null,"",null,{"$f":"IF(ISERROR(VLOOKUP(A10,CODE,5,FALSE)),\"\",(VLOOKUP(A10,CODE,5,FALSE)))","v":""},{"$f":"IF(ISERROR(VLOOKUP(A10,CODE,IF(D10=\"PCS\",7,IF(D10=\"LTR\",7,4)),FALSE)),\"\",VLOOKUP(A10,CODE,IF(D10=\"PCS\",7,IF(D10=\"LTR\",7,4)),FALSE))","v":""},null,""]
[null,"",null,{"$f":"IF(ISERROR(VLOOKUP(A11,CODE,5,FALSE)),\"\",(VLOOKUP(A11,CODE,5,FALSE)))","v":""},{"$f":"IF(ISERROR(VLOOKUP(A11,CODE,IF(D11=\"PCS\",7,IF(D11=\"LTR\",7,4)),FALSE)),\"\",VLOOKUP(A11,CODE,IF(D11=\"PCS\",7,IF(D11=\"LTR\",7,4)),FALSE))","v":""},null,""]
[null,"",null,{"$f":"IF(ISERROR(VLOOKUP(A12,CODE,5,FALSE)),\"\",(VLOOKUP(A12,CODE,5,FALSE)))","v":""},{"$f":"IF(ISERROR(VLOOKUP(A12,CODE,IF(D12=\"PCS\",7,IF(D12=\"LTR\",7,4)),FALSE)),\"\",VLOOKUP(A12,CODE,IF(D12=\"PCS\",7,IF(D12=\"LTR\",7,4)),FALSE))","v":""},null,""]
[null,"",null,{"$f":"IF(ISERROR(VLOOKUP(A13,CODE,5,FALSE)),\"\",(VLOOKUP(A13,CODE,5,FALSE)))","v":""},{"$f":"IF(ISERROR(VLOOKUP(A13,CODE,IF(D13=\"PCS\",7,IF(D13=\"LTR\",7,4)),FALSE)),\"\",VLOOKUP(A13,CODE,IF(D13=\"PCS\",7,IF(D13=\"LTR\",7,4)),FALSE))","v":""},null,""]
[null,"",null,{"$f":"IF(ISERROR(VLOOKUP(A14,CODE,5,FALSE)),\"\",(VLOOKUP(A14,CODE,5,FALSE)))","v":""},{"$f":"IF(ISERROR(VLOOKUP(A14,CODE,IF(D14=\"PCS\",7,IF(D14=\"LTR\",7,4)),FALSE)),\"\",VLOOKUP(A14,CODE,IF(D14=\"PCS\",7,IF(D14=\"LTR\",7,4)),FALSE))","v":""},null,""]
[null,"",null,{"$f":"IF(ISERROR(VLOOKUP(A15,CODE,5,FALSE)),\"\",(VLOOKUP(A15,CODE,5,FALSE)))","v":""},{"$f":"IF(ISERROR(VLOOKUP(A15,CODE,IF(D15=\"PCS\",7,IF(D15=\"LTR\",7,4)),FALSE)),\"\",VLOOKUP(A15,CODE,IF(D15=\"PCS\",7,IF(D15=\"LTR\",7,4)),FALSE))","v":""},null,""]
[null,"",null,{"$f":"IF(ISERROR(VLOOKUP(A16,CODE,5,FALSE)),\"\",(VLOOKUP(A16,CODE,5,FALSE)))","v":""},{"$f":"IF(ISERROR(VLOOKUP(A16,CODE,IF(D16=\"PCS\",7,IF(D16=\"LTR\",7,4)),FALSE)),\"\",VLOOKUP(A16,CODE,IF(D16=\"PCS\",7,IF(D16=\"LTR\",7,4)),FALSE))","v":""},null,""]
[null,"",null,{"$f":"IF(ISERROR(VLOOKUP(A17,CODE,5,FALSE)),\"\",(VLOOKUP(A17,CODE,5,FALSE)))","v":""},{"$f":"IF(ISERROR(VLOOKUP(A17,CODE,IF(D17=\"PCS\",7,IF(D17=\"LTR\",7,4)),FALSE)),\"\",VLOOKUP(A17,CODE,IF(D17=\"PCS\",7,IF(D17=\"LTR\",7,4)),FALSE))","v":""},null,""]
[null,"",null,{"$f":"IF(ISERROR(VLOOKUP(A18,CODE,5,FALSE)),\"\",(VLOOKUP(A18,CODE,5,FALSE)))","v":""},{"$f":"IF(ISERROR(VLOOKUP(A18,CODE,IF(D18=\"PCS\",7,IF(D18=\"LTR\",7,4)),FALSE)),\"\",VLOOKUP(A18,CODE,IF(D18=\"PCS\",7,IF(D18=\"LTR\",7,4)),FALSE))","v":""},null,""]
[null,"",null,{"$f":"IF(ISERROR(VLOOKUP(A19,CODE,5,FALSE)),\"\",(VLOOKUP(A19,CODE,5,FALSE)))","v":""},{"$f":"IF(ISERROR(VLOOKUP(A19,CODE,IF(D19=\"PCS\",7,IF(D19=\"LTR\",7,4)),FALSE)),\"\",VLOOKUP(A19,CODE,IF(D19=\"PCS\",7,IF(D19=\"LTR\",7,4)),FALSE))","v":""},null,""]
[null,"",null,{"$f":"IF(ISERROR(VLOOKUP(A20,CODE,5,FALSE)),\"\",(VLOOKUP(A20,CODE,5,FALSE)))","v":""},{"$f":"IF(ISERROR(VLOOKUP(A20,CODE,IF(D20=\"PCS\",7,IF(D20=\"LTR\",7,4)),FALSE)),\"\",VLOOKUP(A20,CODE,IF(D20=\"PCS\",7,IF(D20=\"LTR\",7,4)),FALSE))","v":""},null,""]
[null,"",null,{"$f":"IF(ISERROR(VLOOKUP(A21,CODE,5,FALSE)),\"\",(VLOOKUP(A21,CODE,5,FALSE)))","v":""},{"$f":"IF(ISERROR(VLOOKUP(A21,CODE,IF(D21=\"PCS\",7,IF(D21=\"LTR\",7,4)),FALSE)),\"\",VLOOKUP(A21,CODE,IF(D21=\"PCS\",7,IF(D21=\"LTR\",7,4)),FALSE))","v":""},null,""]
[null,null,null,null,"TOTAL",null,{"$f":"SUM(G6:G21)","v":0}]
[null,"PENERIMA"]

{"sheet":"CETAK NOTA","index":1,"n_rows":73,"n_cols":9,"rows_kept":73,"cut":false,"hidden":false,"merged":[[21,4,21,5],[23,2,23,3],[1,1,2,1],[1,2,2,3],[1,4,1,5],[2,4,2,5],[4,2,4,3],[73,2,73,3],[26,1,27,1],[26,2,27,3],[26,4,26,5],[27,4,27,5],[29,2,29,3],[46,4,46,5],[48,2,48,3],[51,1,52,1],[51,2,52,3],[51,4,51,5],[52,4,52,5],[54,2,54,3],[71,4,71,5]]}
[3,null,"NO =",3]
[null,"NOTA KONTAN",null,null,"Kepada Yth =",null,{"$f":"IF(ISERROR(VLOOKUP(D1,tagname,2,FALSE)),\"\",VLOOKUP(D1,tagname,2,FALSE))","v":"SUMBER HIDUP"},"FROM",1]
[null,null,null,null,"ALAMAT =",null,{"$f":"IF(ISERROR(VLOOKUP(D1,tagname,3,FALSE)),\"\",VLOOKUP(D1,tagname,3,FALSE))","v":"JATIMANUNGGAL"},"TO",2]
[null,null,null,null,null,null,null,"COPIES",1]
["CODE","NAMA BARANG","QUANTITY",null,"HARGA","DISC","SUB TOTAL"]
[1,{"$f":"IF(ISERROR(VLOOKUP(A6,CODE,2,FALSE)),\"\",(VLOOKUP(A6,CODE,2,FALSE)))","v":"BUKU TULIS"},3,{"$f":"IF(ISERROR(VLOOKUP(A6,CODE,5,FALSE)),\"\",(VLOOKUP(A6,CODE,5,FALSE)))","v":"DOS"},{"$f":"IF(ISERROR(VLOOKUP(A6,CODE,IF(D6=\"PCS\",7,IF(D6=\"LTR\",7,4)),FALSE)),\"\",VLOOKUP(A6,CODE,IF(D6=\"PCS\",7,IF(D6=\"LTR\",7,4)),FALSE))","v":582000},null,{"$f":"IF(ISERROR((C6*E6)-(C6*E6)*F6),\"\",((C6*E6)-(C6*E6)*F6))","v":1746000}]
[null,"",null,"","",null,{"$f":"IF(ISERROR((C7*E7)-(C7*E7)*F7),\"\",((C7*E7)-(C7*E7)*F7))","v":""}]
[null,"",null,"","",null,{"$f":"IF(ISERROR((C8*E8)-(C8*E8)*F8),\"\",((C8*E8)-(C8*E8)*F8))","v":""}]
[null,"",null,"","",null,""]
[null,"",null,"","",null,""]
[null,"",null,"","",null,""]
[null,"",null,"","",null,""]
[null,"",null,"","",null,""]
[null,"",null,"","",null,""]
[null,"",null,"","",null,""]
[null,"",null,"","",null,""]
[null,"",null,"","",null,""]
[null,"",null,"","",null,""]
[null,"",null,"","",null,""]
[null,"",null,"","",null,""]
[null,"",null,"","",null,""]
[null,null,null,null,"TOTAL",null,{"$f":"SUM(G6:G21)","v":1746000}]
[null,"PENERIMA"]
[]
[]
[2,null,"NO =",1]
[null,"NOTA KONTAN",null,null,"Kepada Yth =",null,{"$f":"IF(ISERROR(VLOOKUP(D26,tagname,2,FALSE)),\"\",VLOOKUP(D26,tagname,2,FALSE))","v":"SUMBER SUKSES"}]
[null,null,null,null,"ALAMAT =",null,{"$f":"IF(ISERROR(VLOOKUP(D26,tagname,3,FALSE)),\"\",VLOOKUP(D26,tagname,3,FALSE))","v":"JATIARUM"}]
[]
["CODE","NAMA BARANG","QUANTITY",null,"HARGA","DISC","SUB TOTAL"]
[1,{"$f":"IF(ISERROR(VLOOKUP(A31,CODE,2,FALSE)),\"\",(VLOOKUP(A31,CODE,2,FALSE)))","v":"BUKU TULIS"},1,{"$f":"IF(ISERROR(VLOOKUP(A31,CODE,5,FALSE)),\"\",(VLOOKUP(A31,CODE,5,FALSE)))","v":"DOS"},{"$f":"IF(ISERROR(VLOOKUP(A31,CODE,IF(D31=\"PCS\",7,IF(D31=\"LTR\",7,4)),FALSE)),\"\",VLOOKUP(A31,CODE,IF(D31=\"PCS\",7,IF(D31=\"LTR\",7,4)),FALSE))","v":582000},null,{"$f":"IF(ISERROR((C31*E31)-(C31*E31)*F31),\"\",((C31*E31)-(C31*E31)*F31))","v":582000}]
[2,"PENSIL",1,"DOS",655800,null,{"$f":"IF(ISERROR((C32*E32)-(C32*E32)*F32),\"\",((C32*E32)-(C32*E32)*F32))","v":655800}]
[3,"PENGGARIS",3,"DOS",532000,null,{"$f":"IF(ISERROR((C33*E33)-(C33*E33)*F33),\"\",((C33*E33)-(C33*E33)*F33))","v":1596000}]
[null,"",null,"","",null,""]
[null,"",null,"","",null,""]
[null,"",null,"","",null,""]
[null,"",null,"","",null,""]
[null,"",null,"","",null,""]
[null,"",null,"","",null,""]
[null,"",null,"","",null,""]
[null,"",null,"","",null,""]
[null,"",null,"","",null,""]
[null,"",null,"","",null,""]
[null,"",null,"","",null,""]
[null,"",null,"","",null,""]
[null,"",null,"","",null,""]
[null,null,null,null,"TOTAL",null,{"$f":"SUM(G31:G46)","v":2833800}]
[null,"PENERIMA"]
[]
[]
[1,null,"NO =",1]
[null,"NOTA KONTAN",null,null,"Kepada Yth =",null,{"$f":"IF(ISERROR(VLOOKUP(D51,tagname,2,FALSE)),\"\",VLOOKUP(D51,tagname,2,FALSE))","v":"SUMBER SUKSES"}]
[null,null,null,null,"ALAMAT =",null,{"$f":"IF(ISERROR(VLOOKUP(D51,tagname,3,FALSE)),\"\",VLOOKUP(D51,tagname,3,FALSE))","v":"JATIARUM"}]
[]
["CODE","NAMA BARANG","QUANTITY",null,"HARGA","DISC","SUB TOTAL"]
[1,{"$f":"IF(ISERROR(VLOOKUP(A56,CODE,2,FALSE)),\"\",(VLOOKUP(A56,CODE,2,FALSE)))","v":"BUKU TULIS"},1,{"$f":"IF(ISERROR(VLOOKUP(A56,CODE,5,FALSE)),\"\",(VLOOKUP(A56,CODE,5,FALSE)))","v":"DOS"},{"$f":"IF(ISERROR(VLOOKUP(A56,CODE,IF(D56=\"PCS\",7,IF(D56=\"LTR\",7,4)),FALSE)),\"\",VLOOKUP(A56,CODE,IF(D56=\"PCS\",7,IF(D56=\"LTR\",7,4)),FALSE))","v":582000},null,{"$f":"IF(ISERROR((C56*E56)-(C56*E56)*F56),\"\",((C56*E56)-(C56*E56)*F56))","v":582000}]
[4,"PENGHAPUS",1,"DOS",529000,null,{"$f":"IF(ISERROR((C57*E57)-(C57*E57)*F57),\"\",((C57*E57)-(C57*E57)*F57))","v":529000}]
[3,"PENGGARIS",4,"DOS",532000,null,{"$f":"IF(ISERROR((C58*E58)-(C58*E58)*F58),\"\",((C58*E58)-(C58*E58)*F58))","v":2128000}]
[null,"",null,"","",null,""]
[null,"",null,"","",null,""]
[null,"",null,"","",null,""]
[null,"",null,"","",null,""]
[null,"",null,"","",null,""]
[null,"",null,"","",null,""]
[null,"",null,"","",null,""]
[null,"",null,"","",null,""]
[null,"",null,"","",null,""]
[null,"",null,"","",null,""]
[null,"",null,"","",null,""]
[null,"",null,"","",null,""]
[null,"",null,"","",null,""]
[null,null,null,null,"TOTAL",null,{"$f":"SUM(G56:G71)","v":3239000}]
[null,"PENERIMA"]

{"sheet":"REKAP BARANG","index":2,"n_rows":473,"n_cols":20,"rows_kept":473,"cut":false,"hidden":false,"merged":[[0,3,0,4],[0,5,0,6],[0,7,0,13]]}
["CODE","NAMA BARANG","RM/TK","QUANTITY",null,"QUANTITY",null,"DETAIL PERINCIAN",null,null,null,null,null,null,"FROM",null,"TO",null,"COPIES",1]
[1,{"$f":"IF(ISERROR(VLOOKUP(A2,CODE,2,FALSE)),\"\",(VLOOKUP(A2,CODE,2,FALSE)))","v":"BUKU TULIS"},{"$f":"IF(AND(K2=0,L2=0),\"\",IF(AND(D2>0,K2>L2),\"RM\",\"TK\"))","v":""},{"$f":"SUMIFS('CETAK NOTA'!$C$6:$C$21:'CETAK NOTA'!$C$1730:$C$1746,'CETAK NOTA'!$D$6:$D$21:'CETAK NOTA'!$D$1730:$D$1746,E2,'CETAK NOTA'!$B$6:$B$21:'CETAK NOTA'!$B$1730:$B$1746,B2)","v":5},"DOS",{"$f":"SUMIFS('CETAK NOTA'!$C$6:$C$21:'CETAK NOTA'!$C$1730:$C$1746,'CETAK NOTA'!$D$6:$D$21:'CETAK NOTA'!$D$1730:$D$1746,G2,'CETAK NOTA'!$B$6:$B$21:'CETAK NOTA'!$B$1730:$B$1746,B2)","v":0},"PCS",3,1,1]
[2,{"$f":"IF(ISERROR(VLOOKUP(A3,CODE,2,FALSE)),\"\",(VLOOKUP(A3,CODE,2,FALSE)))","v":"PENSIL"},"",{"$f":"SUMIFS('CETAK NOTA'!$C$6:$C$21:'CETAK NOTA'!$C$1730:$C$1746,'CETAK NOTA'!$D$6:$D$21:'CETAK NOTA'!$D$1730:$D$1746,E3,'CETAK NOTA'!$B$6:$B$21:'CETAK NOTA'!$B$1730:$B$1746,B3)","v":1},"DOS",{"$f":"SUMIFS('CETAK NOTA'!$C$6:$C$21:'CETAK NOTA'!$C$1730:$C$1746,'CETAK NOTA'!$D$6:$D$21:'CETAK NOTA'!$D$1730:$D$1746,G3,'CETAK NOTA'!$B$6:$B$21:'CETAK NOTA'!$B$1730:$B$1746,B3)","v":0},"PCS",1]
[3,{"$f":"IF(ISERROR(VLOOKUP(A4,CODE,2,FALSE)),\"\",(VLOOKUP(A4,CODE,2,FALSE)))","v":"PENGGARIS"},"",{"$f":"SUMIFS('CETAK NOTA'!$C$6:$C$21:'CETAK NOTA'!$C$1730:$C$1746,'CETAK NOTA'!$D$6:$D$21:'CETAK NOTA'!$D$1730:$D$1746,E4,'CETAK NOTA'!$B$6:$B$21:'CETAK NOTA'!$B$1730:$B$1746,B4)","v":7},"DOS",{"$f":"SUMIFS('CETAK NOTA'!$C$6:$C$21:'CETAK NOTA'!$C$1730:$C$1746,'CETAK NOTA'!$D$6:$D$21:'CETAK NOTA'!$D$1730:$D$1746,G4,'CETAK NOTA'!$B$6:$B$21:'CETAK NOTA'!$B$1730:$B$1746,B4)","v":0},"PCS",3,4]
[4,"PENGHAPUS","",{"$f":"SUMIFS('CETAK NOTA'!$C$6:$C$21:'CETAK NOTA'!$C$1730:$C$1746,'CETAK NOTA'!$D$6:$D$21:'CETAK NOTA'!$D$1730:$D$1746,E5,'CETAK NOTA'!$B$6:$B$21:'CETAK NOTA'!$B$1730:$B$1746,B5)","v":1},"DOS",{"$f":"SUMIFS('CETAK NOTA'!$C$6:$C$21:'CETAK NOTA'!$C$1730:$C$1746,'CETAK NOTA'!$D$6:$D$21:'CETAK NOTA'!$D$1730:$D$1746,G5,'CETAK NOTA'!$B$6:$B$21:'CETAK NOTA'!$B$1730:$B$1746,B5)","v":0},"PCS",1]
[5,"BOLPOIN","",{"$f":"SUMIFS('CETAK NOTA'!$C$6:$C$21:'CETAK NOTA'!$C$1730:$C$1746,'CETAK NOTA'!$D$6:$D$21:'CETAK NOTA'!$D$1730:$D$1746,E6,'CETAK NOTA'!$B$6:$B$21:'CETAK NOTA'!$B$1730:$B$1746,B6)","v":0},"DOS",{"$f":"SUMIFS('CETAK NOTA'!$C$6:$C$21:'CETAK NOTA'!$C$1730:$C$1746,'CETAK NOTA'!$D$6:$D$21:'CETAK NOTA'!$D$1730:$D$1746,G6,'CETAK NOTA'!$B$6:$B$21:'CETAK NOTA'!$B$1730:$B$1746,B6)","v":0},"PCS"]
[6,"STAPLER","",{"$f":"SUMIFS('CETAK NOTA'!$C$6:$C$21:'CETAK NOTA'!$C$1730:$C$1746,'CETAK NOTA'!$D$6:$D$21:'CETAK NOTA'!$D$1730:$D$1746,E7,'CETAK NOTA'!$B$6:$B$21:'CETAK NOTA'!$B$1730:$B$1746,B7)","v":0},"DOS",{"$f":"SUMIFS('CETAK NOTA'!$C$6:$C$21:'CETAK NOTA'!$C$1730:$C$1746,'CETAK NOTA'!$D$6:$D$21:'CETAK NOTA'!$D$1730:$D$1746,G7,'CETAK NOTA'!$B$6:$B$21:'CETAK NOTA'!$B$1730:$B$1746,B7)","v":0},"PCS"]
[7,"ISOLASI","",{"$f":"SUMIFS('CETAK NOTA'!$C$6:$C$21:'CETAK NOTA'!$C$1730:$C$1746,'CETAK NOTA'!$D$6:$D$21:'CETAK NOTA'!$D$1730:$D$1746,E8,'CETAK NOTA'!$B$6:$B$21:'CETAK NOTA'!$B$1730:$B$1746,B8)","v":0},"DOS",{"$f":"SUMIFS('CETAK NOTA'!$C$6:$C$21:'CETAK NOTA'!$C$1730:$C$1746,'CETAK NOTA'!$D$6:$D$21:'CETAK NOTA'!$D$1730:$D$1746,G8,'CETAK NOTA'!$B$6:$B$21:'CETAK NOTA'!$B$1730:$B$1746,B8)","v":0},"PCS"]
[null,null,"",{"$f":"SUMIFS('CETAK NOTA'!$C$6:$C$21:'CETAK NOTA'!$C$1730:$C$1746,'CETAK NOTA'!$D$6:$D$21:'CETAK NOTA'!$D$1730:$D$1746,E9,'CETAK NOTA'!$B$6:$B$21:'CETAK NOTA'!$B$1730:$B$1746,B9)","v":0},null,{"$f":"SUMIFS('CETAK NOTA'!$C$6:$C$21:'CETAK NOTA'!$C$1730:$C$1746,'CETAK NOTA'!$D$6:$D$21:'CETAK NOTA'!$D$1730:$D$1746,G9,'CETAK NOTA'!$B$6:$B$21:'CETAK NOTA'!$B$1730:$B$1746,B9)","v":0}]
[null,null,"",{"$f":"SUMIFS('CETAK NOTA'!$C$6:$C$21:'CETAK NOTA'!$C$1730:$C$1746,'CETAK NOTA'!$D$6:$D$21:'CETAK NOTA'!$D$1730:$D$1746,E10,'CETAK NOTA'!$B$6:$B$21:'CETAK NOTA'!$B$1730:$B$1746,B10)","v":0},null,{"$f":"SUMIFS('CETAK NOTA'!$C$6:$C$21:'CETAK NOTA'!$C$1730:$C$1746,'CETAK NOTA'!$D$6:$D$21:'CETAK NOTA'!$D$1730:$D$1746,G10,'CETAK NOTA'!$B$6:$B$21:'CETAK NOTA'!$B$1730:$B$1746,B10)","v":0}]
[null,null,"",{"$f":"SUMIFS('CETAK NOTA'!$C$6:$C$21:'CETAK NOTA'!$C$1730:$C$1746,'CETAK NOTA'!$D$6:$D$21:'CETAK NOTA'!$D$1730:$D$1746,E11,'CETAK NOTA'!$B$6:$B$21:'CETAK NOTA'!$B$1730:$B$1746,B11)","v":0},null,{"$f":"SUMIFS('CETAK NOTA'!$C$6:$C$21:'CETAK NOTA'!$C$1730:$C$1746,'CETAK NOTA'!$D$6:$D$21:'CETAK NOTA'!$D$1730:$D$1746,G11,'CETAK NOTA'!$B$6:$B$21:'CETAK NOTA'!$B$1730:$B$1746,B11)","v":0}]
[null,null,"",{"$f":"SUMIFS('CETAK NOTA'!$C$6:$C$21:'CETAK NOTA'!$C$1730:$C$1746,'CETAK NOTA'!$D$6:$D$21:'CETAK NOTA'!$D$1730:$D$1746,E12,'CETAK NOTA'!$B$6:$B$21:'CETAK NOTA'!$B$1730:$B$1746,B12)","v":0},null,{"$f":"SUMIFS('CETAK NOTA'!$C$6:$C$21:'CETAK NOTA'!$C$1730:$C$1746,'CETAK NOTA'!$D$6:$D$21:'CETAK NOTA'!$D$1730:$D$1746,G12,'CETAK NOTA'!$B$6:$B$21:'CETAK NOTA'!$B$1730:$B$1746,B12)","v":0}]
[null,null,"",{"$f":"SUMIFS('CETAK NOTA'!$C$6:$C$21:'CETAK NOTA'!$C$1730:$C$1746,'CETAK NOTA'!$D$6:$D$21:'CETAK NOTA'!$D$1730:$D$1746,E13,'CETAK NOTA'!$B$6:$B$21:'CETAK NOTA'!$B$1730:$B$1746,B13)","v":0},null,{"$f":"SUMIFS('CETAK NOTA'!$C$6:$C$21:'CETAK NOTA'!$C$1730:$C$1746,'CETAK NOTA'!$D$6:$D$21:'CETAK NOTA'!$D$1730:$D$1746,G13,'CETAK NOTA'!$B$6:$B$21:'CETAK NOTA'!$B$1730:$B$1746,B13)","v":0}]
[null,null,"",{"$f":"SUMIFS('CETAK NOTA'!$C$6:$C$21:'CETAK NOTA'!$C$1730:$C$1746,'CETAK NOTA'!$D$6:$D$21:'CETAK NOTA'!$D$1730:$D$1746,E14,'CETAK NOTA'!$B$6:$B$21:'CETAK NOTA'!$B$1730:$B$1746,B14)","v":0},null,{"$f":"SUMIFS('CETAK NOTA'!$C$6:$C$21:'CETAK NOTA'!$C$1730:$C$1746,'CETAK NOTA'!$D$6:$D$21:'CETAK NOTA'!$D$1730:$D$1746,G14,'CETAK NOTA'!$B$6:$B$21:'CETAK NOTA'!$B$1730:$B$1746,B14)","v":0}]
[null,null,"",{"$f":"SUMIFS('CETAK NOTA'!$C$6:$C$21:'CETAK NOTA'!$C$1730:$C$1746,'CETAK NOTA'!$D$6:$D$21:'CETAK NOTA'!$D$1730:$D$1746,E15,'CETAK NOTA'!$B$6:$B$21:'CETAK NOTA'!$B$1730:$B$1746,B15)","v":0},null,{"$f":"SUMIFS('CETAK NOTA'!$C$6:$C$21:'CETAK NOTA'!$C$1730:$C$1746,'CETAK NOTA'!$D$6:$D$21:'CETAK NOTA'!$D$1730:$D$1746,G15,'CETAK NOTA'!$B$6:$B$21:'CETAK NOTA'!$B$1730:$B$1746,B15)","v":0}]
[null,null,"",{"$f":"SUMIFS('CETAK NOTA'!$C$6:$C$21:'CETAK NOTA'!$C$1730:$C$1746,'CETAK NOTA'!$D$6:$D$21:'CETAK NOTA'!$D$1730:$D$1746,E16,'CETAK NOTA'!$B$6:$B$21:'CETAK NOTA'!$B$1730:$B$1746,B16)","v":0},null,{"$f":"SUMIFS('CETAK NOTA'!$C$6:$C$21:'CETAK NOTA'!$C$1730:$C$1746,'CETAK NOTA'!$D$6:$D$21:'CETAK NOTA'!$D$1730:$D$1746,G16,'CETAK NOTA'!$B$6:$B$21:'CETAK NOTA'!$B$1730:$B$1746,B16)","v":0}]
[null,null,"",{"$f":"SUMIFS('CETAK NOTA'!$C$6:$C$21:'CETAK NOTA'!$C$1730:$C$1746,'CETAK NOTA'!$D$6:$D$21:'CETAK NOTA'!$D$1730:$D$1746,E17,'CETAK NOTA'!$B$6:$B$21:'CETAK NOTA'!$B$1730:$B$1746,B17)","v":0},null,{"$f":"SUMIFS('CETAK NOTA'!$C$6:$C$21:'CETAK NOTA'!$C$1730:$C$1746,'CETAK NOTA'!$D$6:$D$21:'CETAK NOTA'!$D$1730:$D$1746,G17,'CETAK NOTA'!$B$6:$B$21:'CETAK NOTA'!$B$1730:$B$1746,B17)","v":0}]
[null,null,"",{"$f":"SUMIFS('CETAK NOTA'!$C$6:$C$21:'CETAK NOTA'!$C$1730:$C$1746,'CETAK NOTA'!$D$6:$D$21:'CETAK NOTA'!$D$1730:$D$1746,E18,'CETAK NOTA'!$B$6:$B$21:'CETAK NOTA'!$B$1730:$B$1746,B18)","v":0},null,{"$f":"SUMIFS('CETAK NOTA'!$C$6:$C$21:'CETAK NOTA'!$C$1730:$C$1746,'CETAK NOTA'!$D$6:$D$21:'CETAK NOTA'!$D$1730:$D$1746,G18,'CETAK NOTA'!$B$6:$B$21:'CETAK NOTA'!$B$1730:$B$1746,B18)","v":0}]
[null,null,"",{"$f":"SUMIFS('CETAK NOTA'!$C$6:$C$21:'CETAK NOTA'!$C$1730:$C$1746,'CETAK NOTA'!$D$6:$D$21:'CETAK NOTA'!$D$1730:$D$1746,E19,'CETAK NOTA'!$B$6:$B$21:'CETAK NOTA'!$B$1730:$B$1746,B19)","v":0},null,{"$f":"SUMIFS('CETAK NOTA'!$C$6:$C$21:'CETAK NOTA'!$C$1730:$C$1746,'CETAK NOTA'!$D$6:$D$21:'CETAK NOTA'!$D$1730:$D$1746,G19,'CETAK NOTA'!$B$6:$B$21:'CETAK NOTA'!$B$1730:$B$1746,B19)","v":0}]
[null,null,"",{"$f":"SUMIFS('CETAK NOTA'!$C$6:$C$21:'CETAK NOTA'!$C$1730:$C$1746,'CETAK NOTA'!$D$6:$D$21:'CETAK NOTA'!$D$1730:$D$1746,E20,'CETAK NOTA'!$B$6:$B$21:'CETAK NOTA'!$B$1730:$B$1746,B20)","v":0},null,{"$f":"SUMIFS('CETAK NOTA'!$C$6:$C$21:'CETAK NOTA'!$C$1730:$C$1746,'CETAK NOTA'!$D$6:$D$21:'CETAK NOTA'!$D$1730:$D$1746,G20,'CETAK NOTA'!$B$6:$B$21:'CETAK NOTA'!$B$1730:$B$1746,B20)","v":0}]
[null,null,"",{"$f":"SUMIFS('CETAK NOTA'!$C$6:$C$21:'CETAK NOTA'!$C$1730:$C$1746,'CETAK NOTA'!$D$6:$D$21:'CETAK NOTA'!$D$1730:$D$1746,E21,'CETAK NOTA'!$B$6:$B$21:'CETAK NOTA'!$B$1730:$B$1746,B21)","v":0},null,{"$f":"SUMIFS('CETAK NOTA'!$C$6:$C$21:'CETAK NOTA'!$C$1730:$C$1746,'CETAK NOTA'!$D$6:$D$21:'CETAK NOTA'!$D$1730:$D$1746,G21,'CETAK NOTA'!$B$6:$B$21:'CETAK NOTA'!$B$1730:$B$1746,B21)","v":0}]
[null,null,"",{"$f":"SUMIFS('CETAK NOTA'!$C$6:$C$21:'CETAK NOTA'!$C$1730:$C$1746,'CETAK NOTA'!$D$6:$D$21:'CETAK NOTA'!$D$1730:$D$1746,E22,'CETAK NOTA'!$B$6:$B$21:'CETAK NOTA'!$B$1730:$B$1746,B22)","v":0},null,{"$f":"SUMIFS('CETAK NOTA'!$C$6:$C$21:'CETAK NOTA'!$C$1730:$C$1746,'CETAK NOTA'!$D$6:$D$21:'CETAK NOTA'!$D$1730:$D$1746,G22,'CETAK NOTA'!$B$6:$B$21:'CETAK NOTA'!$B$1730:$B$1746,B22)","v":0}]
[null,null,"",{"$f":"SUMIFS('CETAK NOTA'!$C$6:$C$21:'CETAK NOTA'!$C$1730:$C$1746,'CETAK NOTA'!$D$6:$D$21:'CETAK NOTA'!$D$1730:$D$1746,E23,'CETAK NOTA'!$B$6:$B$21:'CETAK NOTA'!$B$1730:$B$1746,B23)","v":0},null,{"$f":"SUMIFS('CETAK NOTA'!$C$6:$C$21:'CETAK NOTA'!$C$1730:$C$1746,'CETAK NOTA'!$D$6:$D$21:'CETAK NOTA'!$D$1730:$D$1746,G23,'CETAK NOTA'!$B$6:$B$21:'CETAK NOTA'!$B$1730:$B$1746,B23)","v":0}]
[null,null,"",{"$f":"SUMIFS('CETAK NOTA'!$C$6:$C$21:'CETAK NOTA'!$C$1730:$C$1746,'CETAK NOTA'!$D$6:$D$21:'CETAK NOTA'!$D$1730:$D$1746,E24,'CETAK NOTA'!$B$6:$B$21:'CETAK NOTA'!$B$1730:$B$1746,B24)","v":0},null,{"$f":"SUMIFS('CETAK NOTA'!$C$6:$C$21:'CETAK NOTA'!$C$1730:$C$1746,'CETAK NOTA'!$D$6:$D$21:'CETAK NOTA'!$D$1730:$D$1746,G24,'CETAK NOTA'!$B$6:$B$21:'CETAK NOTA'!$B$1730:$B$1746,B24)","v":0}]
[null,null,"",{"$f":"SUMIFS('CETAK NOTA'!$C$6:$C$21:'CETAK NOTA'!$C$1730:$C$1746,'CETAK NOTA'!$D$6:$D$21:'CETAK NOTA'!$D$1730:$D$1746,E25,'CETAK NOTA'!$B$6:$B$21:'CETAK NOTA'!$B$1730:$B$1746,B25)","v":0},null,{"$f":"SUMIFS('CETAK NOTA'!$C$6:$C$21:'CETAK NOTA'!$C$1730:$C$1746,'CETAK NOTA'!$D$6:$D$21:'CETAK NOTA'!$D$1730:$D$1746,G25,'CETAK NOTA'!$B$6:$B$21:'CETAK NOTA'!$B$1730:$B$1746,B25)","v":0}]
[null,null,"",{"$f":"SUMIFS('CETAK NOTA'!$C$6:$C$21:'CETAK NOTA'!$C$1730:$C$1746,'CETAK NOTA'!$D$6:$D$21:'CETAK NOTA'!$D$1730:$D$1746,E26,'CETAK NOTA'!$B$6:$B$21:'CETAK NOTA'!$B$1730:$B$1746,B26)","v":0},null,{"$f":"SUMIFS('CETAK NOTA'!$C$6:$C$21:'CETAK NOTA'!$C$1730:$C$1746,'CETAK NOTA'!$D$6:$D$21:'CETAK NOTA'!$D$1730:$D$1746,G26,'CETAK NOTA'!$B$6:$B$21:'CETAK NOTA'!$B$1730:$B$1746,B26)","v":0}]
[null,null,"",{"$f":"SUMIFS('CETAK NOTA'!$C$6:$C$21:'CETAK NOTA'!$C$1730:$C$1746,'CETAK NOTA'!$D$6:$D$21:'CETAK NOTA'!$D$1730:$D$1746,E27,'CETAK NOTA'!$B$6:$B$21:'CETAK NOTA'!$B$1730:$B$1746,B27)","v":0},null,{"$f":"SUMIFS('CETAK NOTA'!$C$6:$C$21:'CETAK NOTA'!$C$1730:$C$1746,'CETAK NOTA'!$D$6:$D$21:'CETAK NOTA'!$D$1730:$D$1746,G27,'CETAK NOTA'!$B$6:$B$21:'CETAK NOTA'!$B$1730:$B$1746,B27)","v":0}]
[null,null,"",{"$f":"SUMIFS('CETAK NOTA'!$C$6:$C$21:'CETAK NOTA'!$C$1730:$C$1746,'CETAK NOTA'!$D$6:$D$21:'CETAK NOTA'!$D$1730:$D$1746,E28,'CETAK NOTA'!$B$6:$B$21:'CETAK NOTA'!$B$1730:$B$1746,B28)","v":0},null,{"$f":"SUMIFS('CETAK NOTA'!$C$6:$C$21:'CETAK NOTA'!$C$1730:$C$1746,'CETAK NOTA'!$D$6:$D$21:'CETAK NOTA'!$D$1730:$D$1746,G28,'CETAK NOTA'!$B$6:$B$21:'CETAK NOTA'!$B$1730:$B$1746,B28)","v":0}]
[null,null,"",{"$f":"SUMIFS('CETAK NOTA'!$C$6:$C$21:'CETAK NOTA'!$C$1730:$C$1746,'CETAK NOTA'!$D$6:$D$21:'CETAK NOTA'!$D$1730:$D$1746,E29,'CETAK NOTA'!$B$6:$B$21:'CETAK NOTA'!$B$1730:$B$1746,B29)","v":0},null,{"$f":"SUMIFS('CETAK NOTA'!$C$6:$C$21:'CETAK NOTA'!$C$1730:$C$1746,'CETAK NOTA'!$D$6:$D$21:'CETAK NOTA'!$D$1730:$D$1746,G29,'CETAK NOTA'!$B$6:$B$21:'CETAK NOTA'!$B$1730:$B$1746,B29)","v":0}]
[null,null,"",{"$f":"SUMIFS('CETAK NOTA'!$C$6:$C$21:'CETAK NOTA'!$C$1730:$C$1746,'CETAK NOTA'!$D$6:$D$21:'CETAK NOTA'!$D$1730:$D$1746,E30,'CETAK NOTA'!$B$6:$B$21:'CETAK NOTA'!$B$1730:$B$1746,B30)","v":0},null,{"$f":"SUMIFS('CETAK NOTA'!$C$6:$C$21:'CETAK NOTA'!$C$1730:$C$1746,'CETAK NOTA'!$D$6:$D$21:'CETAK NOTA'!$D$1730:$D$1746,G30,'CETAK NOTA'!$B$6:$B$21:'CETAK NOTA'!$B$1730:$B$1746,B30)","v":0}]
[null,null,"",{"$f":"SUMIFS('CETAK NOTA'!$C$6:$C$21:'CETAK NOTA'!$C$1730:$C$1746,'CETAK NOTA'!$D$6:$D$21:'CETAK NOTA'!$D$1730:$D$1746,E31,'CETAK NOTA'!$B$6:$B$21:'CETAK NOTA'!$B$1730:$B$1746,B31)","v":0},null,{"$f":"SUMIFS('CETAK NOTA'!$C$6:$C$21:'CETAK NOTA'!$C$1730:$C$1746,'CETAK NOTA'!$D$6:$D$21:'CETAK NOTA'!$D$1730:$D$1746,G31,'CETAK NOTA'!$B$6:$B$21:'CETAK NOTA'!$B$1730:$B$1746,B31)","v":0}]
[null,null,"",{"$f":"SUMIFS('CETAK NOTA'!$C$6:$C$21:'CETAK NOTA'!$C$1730:$C$1746,'CETAK NOTA'!$D$6:$D$21:'CETAK NOTA'!$D$1730:$D$1746,E32,'CETAK NOTA'!$B$6:$B$21:'CETAK NOTA'!$B$1730:$B$1746,B32)","v":0},null,{"$f":"SUMIFS('CETAK NOTA'!$C$6:$C$21:'CETAK NOTA'!$C$1730:$C$1746,'CETAK NOTA'!$D$6:$D$21:'CETAK NOTA'!$D$1730:$D$1746,G32,'CETAK NOTA'!$B$6:$B$21:'CETAK NOTA'!$B$1730:$B$1746,B32)","v":0}]
[null,null,"",{"$f":"SUMIFS('CETAK NOTA'!$C$6:$C$21:'CETAK NOTA'!$C$1730:$C$1746,'CETAK NOTA'!$D$6:$D$21:'CETAK NOTA'!$D$1730:$D$1746,E33,'CETAK NOTA'!$B$6:$B$21:'CETAK NOTA'!$B$1730:$B$1746,B33)","v":0},null,{"$f":"SUMIFS('CETAK NOTA'!$C$6:$C$21:'CETAK NOTA'!$C$1730:$C$1746,'CETAK NOTA'!$D$6:$D$21:'CETAK NOTA'!$D$1730:$D$1746,G33,'CETAK NOTA'!$B$6:$B$21:'CETAK NOTA'!$B$1730:$B$1746,B33)","v":0}]
[null,null,"",{"$f":"SUMIFS('CETAK NOTA'!$C$6:$C$21:'CETAK NOTA'!$C$1730:$C$1746,'CETAK NOTA'!$D$6:$D$21:'CETAK NOTA'!$D$1730:$D$1746,E34,'CETAK NOTA'!$B$6:$B$21:'CETAK NOTA'!$B$1730:$B$1746,B34)","v":0},null,{"$f":"SUMIFS('CETAK NOTA'!$C$6:$C$21:'CETAK NOTA'!$C$1730:$C$1746,'CETAK NOTA'!$D$6:$D$21:'CETAK NOTA'!$D$1730:$D$1746,G34,'CETAK NOTA'!$B$6:$B$21:'CETAK NOTA'!$B$1730:$B$1746,B34)","v":0}]
[null,null,"",{"$f":"SUMIFS('CETAK NOTA'!$C$6:$C$21:'CETAK NOTA'!$C$1730:$C$1746,'CETAK NOTA'!$D$6:$D$21:'CETAK NOTA'!$D$1730:$D$1746,E35,'CETAK NOTA'!$B$6:$B$21:'CETAK NOTA'!$B$1730:$B$1746,B35)","v":0},null,{"$f":"SUMIFS('CETAK NOTA'!$C$6:$C$21:'CETAK NOTA'!$C$1730:$C$1746,'CETAK NOTA'!$D$6:$D$21:'CETAK NOTA'!$D$1730:$D$1746,G35,'CETAK NOTA'!$B$6:$B$21:'CETAK NOTA'!$B$1730:$B$1746,B35)","v":0}]
[null,null,"",{"$f":"SUMIFS('CETAK NOTA'!$C$6:$C$21:'CETAK NOTA'!$C$1730:$C$1746,'CETAK NOTA'!$D$6:$D$21:'CETAK NOTA'!$D$1730:$D$1746,E36,'CETAK NOTA'!$B$6:$B$21:'CETAK NOTA'!$B$1730:$B$1746,B36)","v":0},null,{"$f":"SUMIFS('CETAK NOTA'!$C$6:$C$21:'CETAK NOTA'!$C$1730:$C$1746,'CETAK NOTA'!$D$6:$D$21:'CETAK NOTA'!$D$1730:$D$1746,G36,'CETAK NOTA'!$B$6:$B$21:'CETAK NOTA'!$B$1730:$B$1746,B36)","v":0}]
[null,null,"",{"$f":"SUMIFS('CETAK NOTA'!$C$6:$C$21:'CETAK NOTA'!$C$1730:$C$1746,'CETAK NOTA'!$D$6:$D$21:'CETAK NOTA'!$D$1730:$D$1746,E37,'CETAK NOTA'!$B$6:$B$21:'CETAK NOTA'!$B$1730:$B$1746,B37)","v":0},null,{"$f":"SUMIFS('CETAK NOTA'!$C$6:$C$21:'CETAK NOTA'!$C$1730:$C$1746,'CETAK NOTA'!$D$6:$D$21:'CETAK NOTA'!$D$1730:$D$1746,G37,'CETAK NOTA'!$B$6:$B$21:'CETAK NOTA'!$B$1730:$B$1746,B37)","v":0}]
[null,null,"",{"$f":"SUMIFS('CETAK NOTA'!$C$6:$C$21:'CETAK NOTA'!$C$1730:$C$1746,'CETAK NOTA'!$D$6:$D$21:'CETAK NOTA'!$D$1730:$D$1746,E38,'CETAK NOTA'!$B$6:$B$21:'CETAK NOTA'!$B$1730:$B$1746,B38)","v":0},null,{"$f":"SUMIFS('CETAK NOTA'!$C$6:$C$21:'CETAK NOTA'!$C$1730:$C$1746,'CETAK NOTA'!$D$6:$D$21:'CETAK NOTA'!$D$1730:$D$1746,G38,'CETAK NOTA'!$B$6:$B$21:'CETAK NOTA'!$B$1730:$B$1746,B38)","v":0}]
[null,null,"",{"$f":"SUMIFS('CETAK NOTA'!$C$6:$C$21:'CETAK NOTA'!$C$1730:$C$1746,'CETAK NOTA'!$D$6:$D$21:'CETAK NOTA'!$D$1730:$D$1746,E39,'CETAK NOTA'!$B$6:$B$21:'CETAK NOTA'!$B$1730:$B$1746,B39)","v":0},null,{"$f":"SUMIFS('CETAK NOTA'!$C$6:$C$21:'CETAK NOTA'!$C$1730:$C$1746,'CETAK NOTA'!$D$6:$D$21:'CETAK NOTA'!$D$1730:$D$1746,G39,'CETAK NOTA'!$B$6:$B$21:'CETAK NOTA'!$B$1730:$B$1746,B39)","v":0}]
[null,null,"",{"$f":"SUMIFS('CETAK NOTA'!$C$6:$C$21:'CETAK NOTA'!$C$1730:$C$1746,'CETAK NOTA'!$D$6:$D$21:'CETAK NOTA'!$D$1730:$D$1746,E40,'CETAK NOTA'!$B$6:$B$21:'CETAK NOTA'!$B$1730:$B$1746,B40)","v":0},null,{"$f":"SUMIFS('CETAK NOTA'!$C$6:$C$21:'CETAK NOTA'!$C$1730:$C$1746,'CETAK NOTA'!$D$6:$D$21:'CETAK NOTA'!$D$1730:$D$1746,G40,'CETAK NOTA'!$B$6:$B$21:'CETAK NOTA'!$B$1730:$B$1746,B40)","v":0}]
[null,null,"",{"$f":"SUMIFS('CETAK NOTA'!$C$6:$C$21:'CETAK NOTA'!$C$1730:$C$1746,'CETAK NOTA'!$D$6:$D$21:'CETAK NOTA'!$D$1730:$D$1746,E41,'CETAK NOTA'!$B$6:$B$21:'CETAK NOTA'!$B$1730:$B$1746,B41)","v":0},null,{"$f":"SUMIFS('CETAK NOTA'!$C$6:$C$21:'CETAK NOTA'!$C$1730:$C$1746,'CETAK NOTA'!$D$6:$D$21:'CETAK NOTA'!$D$1730:$D$1746,G41,'CETAK NOTA'!$B$6:$B$21:'CETAK NOTA'!$B$1730:$B$1746,B41)","v":0}]
[null,null,"",{"$f":"SUMIFS('CETAK NOTA'!$C$6:$C$21:'CETAK NOTA'!$C$1730:$C$1746,'CETAK NOTA'!$D$6:$D$21:'CETAK NOTA'!$D$1730:$D$1746,E42,'CETAK NOTA'!$B$6:$B$21:'CETAK NOTA'!$B$1730:$B$1746,B42)","v":0},null,{"$f":"SUMIFS('CETAK NOTA'!$C$6:$C$21:'CETAK NOTA'!$C$1730:$C$1746,'CETAK NOTA'!$D$6:$D$21:'CETAK NOTA'!$D$1730:$D$1746,G42,'CETAK NOTA'!$B$6:$B$21:'CETAK NOTA'!$B$1730:$B$1746,B42)","v":0}]
[null,null,"",{"$f":"SUMIFS('CETAK NOTA'!$C$6:$C$21:'CETAK NOTA'!$C$1730:$C$1746,'CETAK NOTA'!$D$6:$D$21:'CETAK NOTA'!$D$1730:$D$1746,E43,'CETAK NOTA'!$B$6:$B$21:'CETAK NOTA'!$B$1730:$B$1746,B43)","v":0},null,{"$f":"SUMIFS('CETAK NOTA'!$C$6:$C$21:'CETAK NOTA'!$C$1730:$C$1746,'CETAK NOTA'!$D$6:$D$21:'CETAK NOTA'!$D$1730:$D$1746,G43,'CETAK NOTA'!$B$6:$B$21:'CETAK NOTA'!$B$1730:$B$1746,B43)","v":0}]
[null,null,"",{"$f":"SUMIFS('CETAK NOTA'!$C$6:$C$21:'CETAK NOTA'!$C$1730:$C$1746,'CETAK NOTA'!$D$6:$D$21:'CETAK NOTA'!$D$1730:$D$1746,E44,'CETAK NOTA'!$B$6:$B$21:'CETAK NOTA'!$B$1730:$B$1746,B44)","v":0},null,{"$f":"SUMIFS('CETAK NOTA'!$C$6:$C$21:'CETAK NOTA'!$C$1730:$C$1746,'CETAK NOTA'!$D$6:$D$21:'CETAK NOTA'!$D$1730:$D$1746,G44,'CETAK NOTA'!$B$6:$B$21:'CETAK NOTA'!$B$1730:$B$1746,B44)","v":0}]
[null,null,"",{"$f":"SUMIFS('CETAK NOTA'!$C$6:$C$21:'CETAK NOTA'!$C$1730:$C$1746,'CETAK NOTA'!$D$6:$D$21:'CETAK NOTA'!$D$1730:$D$1746,E45,'CETAK NOTA'!$B$6:$B$21:'CETAK NOTA'!$B$1730:$B$1746,B45)","v":0},null,{"$f":"SUMIFS('CETAK NOTA'!$C$6:$C$21:'CETAK NOTA'!$C$1730:$C$1746,'CETAK NOTA'!$D$6:$D$21:'CETAK NOTA'!$D$1730:$D$1746,G45,'CETAK NOTA'!$B$6:$B$21:'CETAK NOTA'!$B$1730:$B$1746,B45)","v":0}]
[null,null,"",{"$f":"SUMIFS('CETAK NOTA'!$C$6:$C$21:'CETAK NOTA'!$C$1730:$C$1746,'CETAK NOTA'!$D$6:$D$21:'CETAK NOTA'!$D$1730:$D$1746,E46,'CETAK NOTA'!$B$6:$B$21:'CETAK NOTA'!$B$1730:$B$1746,B46)","v":0},null,{"$f":"SUMIFS('CETAK NOTA'!$C$6:$C$21:'CETAK NOTA'!$C$1730:$C$1746,'CETAK NOTA'!$D$6:$D$21:'CETAK NOTA'!$D$1730:$D$1746,G46,'CETAK NOTA'!$B$6:$B$21:'CETAK NOTA'!$B$1730:$B$1746,B46)","v":0}]
[null,null,"",{"$f":"SUMIFS('CETAK NOTA'!$C$6:$C$21:'CETAK NOTA'!$C$1730:$C$1746,'CETAK NOTA'!$D$6:$D$21:'CETAK NOTA'!$D$1730:$D$1746,E47,'CETAK NOTA'!$B$6:$B$21:'CETAK NOTA'!$B$1730:$B$1746,B47)","v":0},null,{"$f":"SUMIFS('CETAK NOTA'!$C$6:$C$21:'CETAK NOTA'!$C$1730:$C$1746,'CETAK NOTA'!$D$6:$D$21:'CETAK NOTA'!$D$1730:$D$1746,G47,'CETAK NOTA'!$B$6:$B$21:'CETAK NOTA'!$B$1730:$B$1746,B47)","v":0}]
[null,null,"",{"$f":"SUMIFS('CETAK NOTA'!$C$6:$C$21:'CETAK NOTA'!$C$1730:$C$1746,'CETAK NOTA'!$D$6:$D$21:'CETAK NOTA'!$D$1730:$D$1746,E48,'CETAK NOTA'!$B$6:$B$21:'CETAK NOTA'!$B$1730:$B$1746,B48)","v":0},null,{"$f":"SUMIFS('CETAK NOTA'!$C$6:$C$21:'CETAK NOTA'!$C$1730:$C$1746,'CETAK NOTA'!$D$6:$D$21:'CETAK NOTA'!$D$1730:$D$1746,G48,'CETAK NOTA'!$B$6:$B$21:'CETAK NOTA'!$B$1730:$B$1746,B48)","v":0}]
[null,null,"",{"$f":"SUMIFS('CETAK NOTA'!$C$6:$C$21:'CETAK NOTA'!$C$1730:$C$1746,'CETAK NOTA'!$D$6:$D$21:'CETAK NOTA'!$D$1730:$D$1746,E49,'CETAK NOTA'!$B$6:$B$21:'CETAK NOTA'!$B$1730:$B$1746,B49)","v":0},null,{"$f":"SUMIFS('CETAK NOTA'!$C$6:$C$21:'CETAK NOTA'!$C$1730:$C$1746,'CETAK NOTA'!$D$6:$D$21:'CETAK NOTA'!$D$1730:$D$1746,G49,'CETAK NOTA'!$B$6:$B$21:'CETAK NOTA'!$B$1730:$B$1746,B49)","v":0}]
[null,null,"",{"$f":"SUMIFS('CETAK NOTA'!$C$6:$C$21:'CETAK NOTA'!$C$1730:$C$1746,'CETAK NOTA'!$D$6:$D$21:'CETAK NOTA'!$D$1730:$D$1746,E50,'CETAK NOTA'!$B$6:$B$21:'CETAK NOTA'!$B$1730:$B$1746,B50)","v":0},null,{"$f":"SUMIFS('CETAK NOTA'!$C$6:$C$21:'CETAK NOTA'!$C$1730:$C$1746,'CETAK NOTA'!$D$6:$D$21:'CETAK NOTA'!$D$1730:$D$1746,G50,'CETAK NOTA'!$B$6:$B$21:'CETAK NOTA'!$B$1730:$B$1746,B50)","v":0}]
[null,null,"",{"$f":"SUMIFS('CETAK NOTA'!$C$6:$C$21:'CETAK NOTA'!$C$1730:$C$1746,'CETAK NOTA'!$D$6:$D$21:'CETAK NOTA'!$D$1730:$D$1746,E51,'CETAK NOTA'!$B$6:$B$21:'CETAK NOTA'!$B$1730:$B$1746,B51)","v":0},null,{"$f":"SUMIFS('CETAK NOTA'!$C$6:$C$21:'CETAK NOTA'!$C$1730:$C$1746,'CETAK NOTA'!$D$6:$D$21:'CETAK NOTA'!$D$1730:$D$1746,G51,'CETAK NOTA'!$B$6:$B$21:'CETAK NOTA'!$B$1730:$B$1746,B51)","v":0}]
[null,null,"",{"$f":"SUMIFS('CETAK NOTA'!$C$6:$C$21:'CETAK NOTA'!$C$1730:$C$1746,'CETAK NOTA'!$D$6:$D$21:'CETAK NOTA'!$D$1730:$D$1746,E52,'CETAK NOTA'!$B$6:$B$21:'CETAK NOTA'!$B$1730:$B$1746,B52)","v":0},null,{"$f":"SUMIFS('CETAK NOTA'!$C$6:$C$21:'CETAK NOTA'!$C$1730:$C$1746,'CETAK NOTA'!$D$6:$D$21:'CETAK NOTA'!$D$1730:$D$1746,G52,'CETAK NOTA'!$B$6:$B$21:'CETAK NOTA'!$B$1730:$B$1746,B52)","v":0}]
[null,null,"",{"$f":"SUMIFS('CETAK NOTA'!$C$6:$C$21:'CETAK NOTA'!$C$1730:$C$1746,'CETAK NOTA'!$D$6:$D$21:'CETAK NOTA'!$D$1730:$D$1746,E53,'CETAK NOTA'!$B$6:$B$21:'CETAK NOTA'!$B$1730:$B$1746,B53)","v":0},null,{"$f":"SUMIFS('CETAK NOTA'!$C$6:$C$21:'CETAK NOTA'!$C$1730:$C$1746,'CETAK NOTA'!$D$6:$D$21:'CETAK NOTA'!$D$1730:$D$1746,G53,'CETAK NOTA'!$B$6:$B$21:'CETAK NOTA'!$B$1730:$B$1746,B53)","v":0}]
[null,null,"",{"$f":"SUMIFS('CETAK NOTA'!$C$6:$C$21:'CETAK NOTA'!$C$1730:$C$1746,'CETAK NOTA'!$D$6:$D$21:'CETAK NOTA'!$D$1730:$D$1746,E54,'CETAK NOTA'!$B$6:$B$21:'CETAK NOTA'!$B$1730:$B$1746,B54)","v":0},null,{"$f":"SUMIFS('CETAK NOTA'!$C$6:$C$21:'CETAK NOTA'!$C$1730:$C$1746,'CETAK NOTA'!$D$6:$D$21:'CETAK NOTA'!$D$1730:$D$1746,G54,'CETAK NOTA'!$B$6:$B$21:'CETAK NOTA'!$B$1730:$B$1746,B54)","v":0}]
[null,null,"",{"$f":"SUMIFS('CETAK NOTA'!$C$6:$C$21:'CETAK NOTA'!$C$1730:$C$1746,'CETAK NOTA'!$D$6:$D$21:'CETAK NOTA'!$D$1730:$D$1746,E55,'CETAK NOTA'!$B$6:$B$21:'CETAK NOTA'!$B$1730:$B$1746,B55)","v":0},null,{"$f":"SUMIFS('CETAK NOTA'!$C$6:$C$21:'CETAK NOTA'!$C$1730:$C$1746,'CETAK NOTA'!$D$6:$D$21:'CETAK NOTA'!$D$1730:$D$1746,G55,'CETAK NOTA'!$B$6:$B$21:'CETAK NOTA'!$B$1730:$B$1746,B55)","v":0}]
[null,null,"",{"$f":"SUMIFS('CETAK NOTA'!$C$6:$C$21:'CETAK NOTA'!$C$1730:$C$1746,'CETAK NOTA'!$D$6:$D$21:'CETAK NOTA'!$D$1730:$D$1746,E56,'CETAK NOTA'!$B$6:$B$21:'CETAK NOTA'!$B$1730:$B$1746,B56)","v":0},null,{"$f":"SUMIFS('CETAK NOTA'!$C$6:$C$21:'CETAK NOTA'!$C$1730:$C$1746,'CETAK NOTA'!$D$6:$D$21:'CETAK NOTA'!$D$1730:$D$1746,G56,'CETAK NOTA'!$B$6:$B$21:'CETAK NOTA'!$B$1730:$B$1746,B56)","v":0}]
[null,null,"",{"$f":"SUMIFS('CETAK NOTA'!$C$6:$C$21:'CETAK NOTA'!$C$1730:$C$1746,'CETAK NOTA'!$D$6:$D$21:'CETAK NOTA'!$D$1730:$D$1746,E57,'CETAK NOTA'!$B$6:$B$21:'CETAK NOTA'!$B$1730:$B$1746,B57)","v":0},null,{"$f":"SUMIFS('CETAK NOTA'!$C$6:$C$21:'CETAK NOTA'!$C$1730:$C$1746,'CETAK NOTA'!$D$6:$D$21:'CETAK NOTA'!$D$1730:$D$1746,G57,'CETAK NOTA'!$B$6:$B$21:'CETAK NOTA'!$B$1730:$B$1746,B57)","v":0}]
[null,null,"",{"$f":"SUMIFS('CETAK NOTA'!$C$6:$C$21:'CETAK NOTA'!$C$1730:$C$1746,'CETAK NOTA'!$D$6:$D$21:'CETAK NOTA'!$D$1730:$D$1746,E58,'CETAK NOTA'!$B$6:$B$21:'CETAK NOTA'!$B$1730:$B$1746,B58)","v":0},null,{"$f":"SUMIFS('CETAK NOTA'!$C$6:$C$21:'CETAK NOTA'!$C$1730:$C$1746,'CETAK NOTA'!$D$6:$D$21:'CETAK NOTA'!$D$1730:$D$1746,G58,'CETAK NOTA'!$B$6:$B$21:'CETAK NOTA'!$B$1730:$B$1746,B58)","v":0}]
[null,null,"",{"$f":"SUMIFS('CETAK NOTA'!$C$6:$C$21:'CETAK NOTA'!$C$1730:$C$1746,'CETAK NOTA'!$D$6:$D$21:'CETAK NOTA'!$D$1730:$D$1746,E59,'CETAK NOTA'!$B$6:$B$21:'CETAK NOTA'!$B$1730:$B$1746,B59)","v":0},null,{"$f":"SUMIFS('CETAK NOTA'!$C$6:$C$21:'CETAK NOTA'!$C$1730:$C$1746,'CETAK NOTA'!$D$6:$D$21:'CETAK NOTA'!$D$1730:$D$1746,G59,'CETAK NOTA'!$B$6:$B$21:'CETAK NOTA'!$B$1730:$B$1746,B59)","v":0}]
[null,null,"",{"$f":"SUMIFS('CETAK NOTA'!$C$6:$C$21:'CETAK NOTA'!$C$1730:$C$1746,'CETAK NOTA'!$D$6:$D$21:'CETAK NOTA'!$D$1730:$D$1746,E60,'CETAK NOTA'!$B$6:$B$21:'CETAK NOTA'!$B$1730:$B$1746,B60)","v":0},null,{"$f":"SUMIFS('CETAK NOTA'!$C$6:$C$21:'CETAK NOTA'!$C$1730:$C$1746,'CETAK NOTA'!$D$6:$D$21:'CETAK NOTA'!$D$1730:$D$1746,G60,'CETAK NOTA'!$B$6:$B$21:'CETAK NOTA'!$B$1730:$B$1746,B60)","v":0}]
[null,null,"",{"$f":"SUMIFS('CETAK NOTA'!$C$6:$C$21:'CETAK NOTA'!$C$1730:$C$1746,'CETAK NOTA'!$D$6:$D$21:'CETAK NOTA'!$D$1730:$D$1746,E61,'CETAK NOTA'!$B$6:$B$21:'CETAK NOTA'!$B$1730:$B$1746,B61)","v":0},null,{"$f":"SUMIFS('CETAK NOTA'!$C$6:$C$21:'CETAK NOTA'!$C$1730:$C$1746,'CETAK NOTA'!$D$6:$D$21:'CETAK NOTA'!$D$1730:$D$1746,G61,'CETAK NOTA'!$B$6:$B$21:'CETAK NOTA'!$B$1730:$B$1746,B61)","v":0}]
[null,null,"",{"$f":"SUMIFS('CETAK NOTA'!$C$6:$C$21:'CETAK NOTA'!$C$1730:$C$1746,'CETAK NOTA'!$D$6:$D$21:'CETAK NOTA'!$D$1730:$D$1746,E62,'CETAK NOTA'!$B$6:$B$21:'CETAK NOTA'!$B$1730:$B$1746,B62)","v":0},null,{"$f":"SUMIFS('CETAK NOTA'!$C$6:$C$21:'CETAK NOTA'!$C$1730:$C$1746,'CETAK NOTA'!$D$6:$D$21:'CETAK NOTA'!$D$1730:$D$1746,G62,'CETAK NOTA'!$B$6:$B$21:'CETAK NOTA'!$B$1730:$B$1746,B62)","v":0}]
[null,null,"",{"$f":"SUMIFS('CETAK NOTA'!$C$6:$C$21:'CETAK NOTA'!$C$1730:$C$1746,'CETAK NOTA'!$D$6:$D$21:'CETAK NOTA'!$D$1730:$D$1746,E63,'CETAK NOTA'!$B$6:$B$21:'CETAK NOTA'!$B$1730:$B$1746,B63)","v":0},null,{"$f":"SUMIFS('CETAK NOTA'!$C$6:$C$21:'CETAK NOTA'!$C$1730:$C$1746,'CETAK NOTA'!$D$6:$D$21:'CETAK NOTA'!$D$1730:$D$1746,G63,'CETAK NOTA'!$B$6:$B$21:'CETAK NOTA'!$B$1730:$B$1746,B63)","v":0}]
[null,null,"",{"$f":"SUMIFS('CETAK NOTA'!$C$6:$C$21:'CETAK NOTA'!$C$1730:$C$1746,'CETAK NOTA'!$D$6:$D$21:'CETAK NOTA'!$D$1730:$D$1746,E64,'CETAK NOTA'!$B$6:$B$21:'CETAK NOTA'!$B$1730:$B$1746,B64)","v":0},null,{"$f":"SUMIFS('CETAK NOTA'!$C$6:$C$21:'CETAK NOTA'!$C$1730:$C$1746,'CETAK NOTA'!$D$6:$D$21:'CETAK NOTA'!$D$1730:$D$1746,G64,'CETAK NOTA'!$B$6:$B$21:'CETAK NOTA'!$B$1730:$B$1746,B64)","v":0}]
[null,null,"",{"$f":"SUMIFS('CETAK NOTA'!$C$6:$C$21:'CETAK NOTA'!$C$1730:$C$1746,'CETAK NOTA'!$D$6:$D$21:'CETAK NOTA'!$D$1730:$D$1746,E65,'CETAK NOTA'!$B$6:$B$21:'CETAK NOTA'!$B$1730:$B$1746,B65)","v":0},null,{"$f":"SUMIFS('CETAK NOTA'!$C$6:$C$21:'CETAK NOTA'!$C$1730:$C$1746,'CETAK NOTA'!$D$6:$D$21:'CETAK NOTA'!$D$1730:$D$1746,G65,'CETAK NOTA'!$B$6:$B$21:'CETAK NOTA'!$B$1730:$B$1746,B65)","v":0}]
[null,null,{"$f":"IF(AND(K66=0,L66=0),\"\",IF(AND(D66>0,K66>L66),\"RM\",\"TK\"))","v":""},{"$f":"SUMIFS('CETAK NOTA'!$C$6:$C$21:'CETAK NOTA'!$C$1730:$C$1746,'CETAK NOTA'!$D$6:$D$21:'CETAK NOTA'!$D$1730:$D$1746,E66,'CETAK NOTA'!$B$6:$B$21:'CETAK NOTA'!$B$1730:$B$1746,B66)","v":0},null,{"$f":"SUMIFS('CETAK NOTA'!$C$6:$C$21:'CETAK NOTA'!$C$1730:$C$1746,'CETAK NOTA'!$D$6:$D$21:'CETAK NOTA'!$D$1730:$D$1746,G66,'CETAK NOTA'!$B$6:$B$21:'CETAK NOTA'!$B$1730:$B$1746,B66)","v":0}]
[null,null,"",{"$f":"SUMIFS('CETAK NOTA'!$C$6:$C$21:'CETAK NOTA'!$C$1730:$C$1746,'CETAK NOTA'!$D$6:$D$21:'CETAK NOTA'!$D$1730:$D$1746,E67,'CETAK NOTA'!$B$6:$B$21:'CETAK NOTA'!$B$1730:$B$1746,B67)","v":0},null,{"$f":"SUMIFS('CETAK NOTA'!$C$6:$C$21:'CETAK NOTA'!$C$1730:$C$1746,'CETAK NOTA'!$D$6:$D$21:'CETAK NOTA'!$D$1730:$D$1746,G67,'CETAK NOTA'!$B$6:$B$21:'CETAK NOTA'!$B$1730:$B$1746,B67)","v":0}]
[null,null,"",{"$f":"SUMIFS('CETAK NOTA'!$C$6:$C$21:'CETAK NOTA'!$C$1730:$C$1746,'CETAK NOTA'!$D$6:$D$21:'CETAK NOTA'!$D$1730:$D$1746,E68,'CETAK NOTA'!$B$6:$B$21:'CETAK NOTA'!$B$1730:$B$1746,B68)","v":0},null,{"$f":"SUMIFS('CETAK NOTA'!$C$6:$C$21:'CETAK NOTA'!$C$1730:$C$1746,'CETAK NOTA'!$D$6:$D$21:'CETAK NOTA'!$D$1730:$D$1746,G68,'CETAK NOTA'!$B$6:$B$21:'CETAK NOTA'!$B$1730:$B$1746,B68)","v":0}]
[null,null,"",{"$f":"SUMIFS('CETAK NOTA'!$C$6:$C$21:'CETAK NOTA'!$C$1730:$C$1746,'CETAK NOTA'!$D$6:$D$21:'CETAK NOTA'!$D$1730:$D$1746,E69,'CETAK NOTA'!$B$6:$B$21:'CETAK NOTA'!$B$1730:$B$1746,B69)","v":0},null,{"$f":"SUMIFS('CETAK NOTA'!$C$6:$C$21:'CETAK NOTA'!$C$1730:$C$1746,'CETAK NOTA'!$D$6:$D$21:'CETAK NOTA'!$D$1730:$D$1746,G69,'CETAK NOTA'!$B$6:$B$21:'CETAK NOTA'!$B$1730:$B$1746,B69)","v":0}]
[null,null,"",{"$f":"SUMIFS('CETAK NOTA'!$C$6:$C$21:'CETAK NOTA'!$C$1730:$C$1746,'CETAK NOTA'!$D$6:$D$21:'CETAK NOTA'!$D$1730:$D$1746,E70,'CETAK NOTA'!$B$6:$B$21:'CETAK NOTA'!$B$1730:$B$1746,B70)","v":0},null,{"$f":"SUMIFS('CETAK NOTA'!$C$6:$C$21:'CETAK NOTA'!$C$1730:$C$1746,'CETAK NOTA'!$D$6:$D$21:'CETAK NOTA'!$D$1730:$D$1746,G70,'CETAK NOTA'!$B$6:$B$21:'CETAK NOTA'!$B$1730:$B$1746,B70)","v":0}]
[null,null,"",{"$f":"SUMIFS('CETAK NOTA'!$C$6:$C$21:'CETAK NOTA'!$C$1730:$C$1746,'CETAK NOTA'!$D$6:$D$21:'CETAK NOTA'!$D$1730:$D$1746,E71,'CETAK NOTA'!$B$6:$B$21:'CETAK NOTA'!$B$1730:$B$1746,B71)","v":0},null,{"$f":"SUMIFS('CETAK NOTA'!$C$6:$C$21:'CETAK NOTA'!$C$1730:$C$1746,'CETAK NOTA'!$D$6:$D$21:'CETAK NOTA'!$D$1730:$D$1746,G71,'CETAK NOTA'!$B$6:$B$21:'CETAK NOTA'!$B$1730:$B$1746,B71)","v":0}]
[null,null,"",{"$f":"SUMIFS('CETAK NOTA'!$C$6:$C$21:'CETAK NOTA'!$C$1730:$C$1746,'CETAK NOTA'!$D$6:$D$21:'CETAK NOTA'!$D$1730:$D$1746,E72,'CETAK NOTA'!$B$6:$B$21:'CETAK NOTA'!$B$1730:$B$1746,B72)","v":0},null,{"$f":"SUMIFS('CETAK NOTA'!$C$6:$C$21:'CETAK NOTA'!$C$1730:$C$1746,'CETAK NOTA'!$D$6:$D$21:'CETAK NOTA'!$D$1730:$D$1746,G72,'CETAK NOTA'!$B$6:$B$21:'CETAK NOTA'!$B$1730:$B$1746,B72)","v":0}]
[null,null,"",{"$f":"SUMIFS('CETAK NOTA'!$C$6:$C$21:'CETAK NOTA'!$C$1730:$C$1746,'CETAK NOTA'!$D$6:$D$21:'CETAK NOTA'!$D$1730:$D$1746,E73,'CETAK NOTA'!$B$6:$B$21:'CETAK NOTA'!$B$1730:$B$1746,B73)","v":0},null,{"$f":"SUMIFS('CETAK NOTA'!$C$6:$C$21:'CETAK NOTA'!$C$1730:$C$1746,'CETAK NOTA'!$D$6:$D$21:'CETAK NOTA'!$D$1730:$D$1746,G73,'CETAK NOTA'!$B$6:$B$21:'CETAK NOTA'!$B$1730:$B$1746,B73)","v":0}]
[null,null,"",{"$f":"SUMIFS('CETAK NOTA'!$C$6:$C$21:'CETAK NOTA'!$C$1730:$C$1746,'CETAK NOTA'!$D$6:$D$21:'CETAK NOTA'!$D$1730:$D$1746,E74,'CETAK NOTA'!$B$6:$B$21:'CETAK NOTA'!$B$1730:$B$1746,B74)","v":0},null,{"$f":"SUMIFS('CETAK NOTA'!$C$6:$C$21:'CETAK NOTA'!$C$1730:$C$1746,'CETAK NOTA'!$D$6:$D$21:'CETAK NOTA'!$D$1730:$D$1746,G74,'CETAK NOTA'!$B$6:$B$21:'CETAK NOTA'!$B$1730:$B$1746,B74)","v":0}]
[null,null,"",{"$f":"SUMIFS('CETAK NOTA'!$C$6:$C$21:'CETAK NOTA'!$C$1730:$C$1746,'CETAK NOTA'!$D$6:$D$21:'CETAK NOTA'!$D$1730:$D$1746,E75,'CETAK NOTA'!$B$6:$B$21:'CETAK NOTA'!$B$1730:$B$1746,B75)","v":0},null,{"$f":"SUMIFS('CETAK NOTA'!$C$6:$C$21:'CETAK NOTA'!$C$1730:$C$1746,'CETAK NOTA'!$D$6:$D$21:'CETAK NOTA'!$D$1730:$D$1746,G75,'CETAK NOTA'!$B$6:$B$21:'CETAK NOTA'!$B$1730:$B$1746,B75)","v":0}]
[null,null,"",{"$f":"SUMIFS('CETAK NOTA'!$C$6:$C$21:'CETAK NOTA'!$C$1730:$C$1746,'CETAK NOTA'!$D$6:$D$21:'CETAK NOTA'!$D$1730:$D$1746,E76,'CETAK NOTA'!$B$6:$B$21:'CETAK NOTA'!$B$1730:$B$1746,B76)","v":0},null,{"$f":"SUMIFS('CETAK NOTA'!$C$6:$C$21:'CETAK NOTA'!$C$1730:$C$1746,'CETAK NOTA'!$D$6:$D$21:'CETAK NOTA'!$D$1730:$D$1746,G76,'CETAK NOTA'!$B$6:$B$21:'CETAK NOTA'!$B$1730:$B$1746,B76)","v":0}]
[null,null,"",{"$f":"SUMIFS('CETAK NOTA'!$C$6:$C$21:'CETAK NOTA'!$C$1730:$C$1746,'CETAK NOTA'!$D$6:$D$21:'CETAK NOTA'!$D$1730:$D$1746,E77,'CETAK NOTA'!$B$6:$B$21:'CETAK NOTA'!$B$1730:$B$1746,B77)","v":0},null,{"$f":"SUMIFS('CETAK NOTA'!$C$6:$C$21:'CETAK NOTA'!$C$1730:$C$1746,'CETAK NOTA'!$D$6:$D$21:'CETAK NOTA'!$D$1730:$D$1746,G77,'CETAK NOTA'!$B$6:$B$21:'CETAK NOTA'!$B$1730:$B$1746,B77)","v":0}]
[null,null,"",{"$f":"SUMIFS('CETAK NOTA'!$C$6:$C$21:'CETAK NOTA'!$C$1730:$C$1746,'CETAK NOTA'!$D$6:$D$21:'CETAK NOTA'!$D$1730:$D$1746,E78,'CETAK NOTA'!$B$6:$B$21:'CETAK NOTA'!$B$1730:$B$1746,B78)","v":0},null,{"$f":"SUMIFS('CETAK NOTA'!$C$6:$C$21:'CETAK NOTA'!$C$1730:$C$1746,'CETAK NOTA'!$D$6:$D$21:'CETAK NOTA'!$D$1730:$D$1746,G78,'CETAK NOTA'!$B$6:$B$21:'CETAK NOTA'!$B$1730:$B$1746,B78)","v":0}]
[null,null,"",{"$f":"SUMIFS('CETAK NOTA'!$C$6:$C$21:'CETAK NOTA'!$C$1730:$C$1746,'CETAK NOTA'!$D$6:$D$21:'CETAK NOTA'!$D$1730:$D$1746,E79,'CETAK NOTA'!$B$6:$B$21:'CETAK NOTA'!$B$1730:$B$1746,B79)","v":0},null,{"$f":"SUMIFS('CETAK NOTA'!$C$6:$C$21:'CETAK NOTA'!$C$1730:$C$1746,'CETAK NOTA'!$D$6:$D$21:'CETAK NOTA'!$D$1730:$D$1746,G79,'CETAK NOTA'!$B$6:$B$21:'CETAK NOTA'!$B$1730:$B$1746,B79)","v":0}]
[null,null,"",{"$f":"SUMIFS('CETAK NOTA'!$C$6:$C$21:'CETAK NOTA'!$C$1730:$C$1746,'CETAK NOTA'!$D$6:$D$21:'CETAK NOTA'!$D$1730:$D$1746,E80,'CETAK NOTA'!$B$6:$B$21:'CETAK NOTA'!$B$1730:$B$1746,B80)","v":0},null,{"$f":"SUMIFS('CETAK NOTA'!$C$6:$C$21:'CETAK NOTA'!$C$1730:$C$1746,'CETAK NOTA'!$D$6:$D$21:'CETAK NOTA'!$D$1730:$D$1746,G80,'CETAK NOTA'!$B$6:$B$21:'CETAK NOTA'!$B$1730:$B$1746,B80)","v":0}]
[null,null,"",{"$f":"SUMIFS('CETAK NOTA'!$C$6:$C$21:'CETAK NOTA'!$C$1730:$C$1746,'CETAK NOTA'!$D$6:$D$21:'CETAK NOTA'!$D$1730:$D$1746,E81,'CETAK NOTA'!$B$6:$B$21:'CETAK NOTA'!$B$1730:$B$1746,B81)","v":0},null,{"$f":"SUMIFS('CETAK NOTA'!$C$6:$C$21:'CETAK NOTA'!$C$1730:$C$1746,'CETAK NOTA'!$D$6:$D$21:'CETAK NOTA'!$D$1730:$D$1746,G81,'CETAK NOTA'!$B$6:$B$21:'CETAK NOTA'!$B$1730:$B$1746,B81)","v":0}]
[null,null,"",{"$f":"SUMIFS('CETAK NOTA'!$C$6:$C$21:'CETAK NOTA'!$C$1730:$C$1746,'CETAK NOTA'!$D$6:$D$21:'CETAK NOTA'!$D$1730:$D$1746,E82,'CETAK NOTA'!$B$6:$B$21:'CETAK NOTA'!$B$1730:$B$1746,B82)","v":0},null,{"$f":"SUMIFS('CETAK NOTA'!$C$6:$C$21:'CETAK NOTA'!$C$1730:$C$1746,'CETAK NOTA'!$D$6:$D$21:'CETAK NOTA'!$D$1730:$D$1746,G82,'CETAK NOTA'!$B$6:$B$21:'CETAK NOTA'!$B$1730:$B$1746,B82)","v":0}]
[null,null,"",{"$f":"SUMIFS('CETAK NOTA'!$C$6:$C$21:'CETAK NOTA'!$C$1730:$C$1746,'CETAK NOTA'!$D$6:$D$21:'CETAK NOTA'!$D$1730:$D$1746,E83,'CETAK NOTA'!$B$6:$B$21:'CETAK NOTA'!$B$1730:$B$1746,B83)","v":0},null,{"$f":"SUMIFS('CETAK NOTA'!$C$6:$C$21:'CETAK NOTA'!$C$1730:$C$1746,'CETAK NOTA'!$D$6:$D$21:'CETAK NOTA'!$D$1730:$D$1746,G83,'CETAK NOTA'!$B$6:$B$21:'CETAK NOTA'!$B$1730:$B$1746,B83)","v":0}]
[null,null,"",{"$f":"SUMIFS('CETAK NOTA'!$C$6:$C$21:'CETAK NOTA'!$C$1730:$C$1746,'CETAK NOTA'!$D$6:$D$21:'CETAK NOTA'!$D$1730:$D$1746,E84,'CETAK NOTA'!$B$6:$B$21:'CETAK NOTA'!$B$1730:$B$1746,B84)","v":0},null,{"$f":"SUMIFS('CETAK NOTA'!$C$6:$C$21:'CETAK NOTA'!$C$1730:$C$1746,'CETAK NOTA'!$D$6:$D$21:'CETAK NOTA'!$D$1730:$D$1746,G84,'CETAK NOTA'!$B$6:$B$21:'CETAK NOTA'!$B$1730:$B$1746,B84)","v":0}]
[null,null,"",{"$f":"SUMIFS('CETAK NOTA'!$C$6:$C$21:'CETAK NOTA'!$C$1730:$C$1746,'CETAK NOTA'!$D$6:$D$21:'CETAK NOTA'!$D$1730:$D$1746,E85,'CETAK NOTA'!$B$6:$B$21:'CETAK NOTA'!$B$1730:$B$1746,B85)","v":0},null,{"$f":"SUMIFS('CETAK NOTA'!$C$6:$C$21:'CETAK NOTA'!$C$1730:$C$1746,'CETAK NOTA'!$D$6:$D$21:'CETAK NOTA'!$D$1730:$D$1746,G85,'CETAK NOTA'!$B$6:$B$21:'CETAK NOTA'!$B$1730:$B$1746,B85)","v":0}]
[null,null,"",{"$f":"SUMIFS('CETAK NOTA'!$C$6:$C$21:'CETAK NOTA'!$C$1730:$C$1746,'CETAK NOTA'!$D$6:$D$21:'CETAK NOTA'!$D$1730:$D$1746,E86,'CETAK NOTA'!$B$6:$B$21:'CETAK NOTA'!$B$1730:$B$1746,B86)","v":0},null,{"$f":"SUMIFS('CETAK NOTA'!$C$6:$C$21:'CETAK NOTA'!$C$1730:$C$1746,'CETAK NOTA'!$D$6:$D$21:'CETAK NOTA'!$D$1730:$D$1746,G86,'CETAK NOTA'!$B$6:$B$21:'CETAK NOTA'!$B$1730:$B$1746,B86)","v":0}]
[null,null,"",{"$f":"SUMIFS('CETAK NOTA'!$C$6:$C$21:'CETAK NOTA'!$C$1730:$C$1746,'CETAK NOTA'!$D$6:$D$21:'CETAK NOTA'!$D$1730:$D$1746,E87,'CETAK NOTA'!$B$6:$B$21:'CETAK NOTA'!$B$1730:$B$1746,B87)","v":0},null,{"$f":"SUMIFS('CETAK NOTA'!$C$6:$C$21:'CETAK NOTA'!$C$1730:$C$1746,'CETAK NOTA'!$D$6:$D$21:'CETAK NOTA'!$D$1730:$D$1746,G87,'CETAK NOTA'!$B$6:$B$21:'CETAK NOTA'!$B$1730:$B$1746,B87)","v":0}]
[null,null,"",{"$f":"SUMIFS('CETAK NOTA'!$C$6:$C$21:'CETAK NOTA'!$C$1730:$C$1746,'CETAK NOTA'!$D$6:$D$21:'CETAK NOTA'!$D$1730:$D$1746,E88,'CETAK NOTA'!$B$6:$B$21:'CETAK NOTA'!$B$1730:$B$1746,B88)","v":0},null,{"$f":"SUMIFS('CETAK NOTA'!$C$6:$C$21:'CETAK NOTA'!$C$1730:$C$1746,'CETAK NOTA'!$D$6:$D$21:'CETAK NOTA'!$D$1730:$D$1746,G88,'CETAK NOTA'!$B$6:$B$21:'CETAK NOTA'!$B$1730:$B$1746,B88)","v":0}]
[null,null,"",{"$f":"SUMIFS('CETAK NOTA'!$C$6:$C$21:'CETAK NOTA'!$C$1730:$C$1746,'CETAK NOTA'!$D$6:$D$21:'CETAK NOTA'!$D$1730:$D$1746,E89,'CETAK NOTA'!$B$6:$B$21:'CETAK NOTA'!$B$1730:$B$1746,B89)","v":0},null,{"$f":"SUMIFS('CETAK NOTA'!$C$6:$C$21:'CETAK NOTA'!$C$1730:$C$1746,'CETAK NOTA'!$D$6:$D$21:'CETAK NOTA'!$D$1730:$D$1746,G89,'CETAK NOTA'!$B$6:$B$21:'CETAK NOTA'!$B$1730:$B$1746,B89)","v":0}]
[null,null,"",{"$f":"SUMIFS('CETAK NOTA'!$C$6:$C$21:'CETAK NOTA'!$C$1730:$C$1746,'CETAK NOTA'!$D$6:$D$21:'CETAK NOTA'!$D$1730:$D$1746,E90,'CETAK NOTA'!$B$6:$B$21:'CETAK NOTA'!$B$1730:$B$1746,B90)","v":0},null,{"$f":"SUMIFS('CETAK NOTA'!$C$6:$C$21:'CETAK NOTA'!$C$1730:$C$1746,'CETAK NOTA'!$D$6:$D$21:'CETAK NOTA'!$D$1730:$D$1746,G90,'CETAK NOTA'!$B$6:$B$21:'CETAK NOTA'!$B$1730:$B$1746,B90)","v":0}]
[null,null,"",{"$f":"SUMIFS('CETAK NOTA'!$C$6:$C$21:'CETAK NOTA'!$C$1730:$C$1746,'CETAK NOTA'!$D$6:$D$21:'CETAK NOTA'!$D$1730:$D$1746,E91,'CETAK NOTA'!$B$6:$B$21:'CETAK NOTA'!$B$1730:$B$1746,B91)","v":0},null,{"$f":"SUMIFS('CETAK NOTA'!$C$6:$C$21:'CETAK NOTA'!$C$1730:$C$1746,'CETAK NOTA'!$D$6:$D$21:'CETAK NOTA'!$D$1730:$D$1746,G91,'CETAK NOTA'!$B$6:$B$21:'CETAK NOTA'!$B$1730:$B$1746,B91)","v":0}]
[null,null,"",{"$f":"SUMIFS('CETAK NOTA'!$C$6:$C$21:'CETAK NOTA'!$C$1730:$C$1746,'CETAK NOTA'!$D$6:$D$21:'CETAK NOTA'!$D$1730:$D$1746,E92,'CETAK NOTA'!$B$6:$B$21:'CETAK NOTA'!$B$1730:$B$1746,B92)","v":0},null,{"$f":"SUMIFS('CETAK NOTA'!$C$6:$C$21:'CETAK NOTA'!$C$1730:$C$1746,'CETAK NOTA'!$D$6:$D$21:'CETAK NOTA'!$D$1730:$D$1746,G92,'CETAK NOTA'!$B$6:$B$21:'CETAK NOTA'!$B$1730:$B$1746,B92)","v":0}]
[null,null,"",{"$f":"SUMIFS('CETAK NOTA'!$C$6:$C$21:'CETAK NOTA'!$C$1730:$C$1746,'CETAK NOTA'!$D$6:$D$21:'CETAK NOTA'!$D$1730:$D$1746,E93,'CETAK NOTA'!$B$6:$B$21:'CETAK NOTA'!$B$1730:$B$1746,B93)","v":0},null,{"$f":"SUMIFS('CETAK NOTA'!$C$6:$C$21:'CETAK NOTA'!$C$1730:$C$1746,'CETAK NOTA'!$D$6:$D$21:'CETAK NOTA'!$D$1730:$D$1746,G93,'CETAK NOTA'!$B$6:$B$21:'CETAK NOTA'!$B$1730:$B$1746,B93)","v":0}]
[null,null,"",{"$f":"SUMIFS('CETAK NOTA'!$C$6:$C$21:'CETAK NOTA'!$C$1730:$C$1746,'CETAK NOTA'!$D$6:$D$21:'CETAK NOTA'!$D$1730:$D$1746,E94,'CETAK NOTA'!$B$6:$B$21:'CETAK NOTA'!$B$1730:$B$1746,B94)","v":0},null,{"$f":"SUMIFS('CETAK NOTA'!$C$6:$C$21:'CETAK NOTA'!$C$1730:$C$1746,'CETAK NOTA'!$D$6:$D$21:'CETAK NOTA'!$D$1730:$D$1746,G94,'CETAK NOTA'!$B$6:$B$21:'CETAK NOTA'!$B$1730:$B$1746,B94)","v":0}]
[null,null,"",{"$f":"SUMIFS('CETAK NOTA'!$C$6:$C$21:'CETAK NOTA'!$C$1730:$C$1746,'CETAK NOTA'!$D$6:$D$21:'CETAK NOTA'!$D$1730:$D$1746,E95,'CETAK NOTA'!$B$6:$B$21:'CETAK NOTA'!$B$1730:$B$1746,B95)","v":0},null,{"$f":"SUMIFS('CETAK NOTA'!$C$6:$C$21:'CETAK NOTA'!$C$1730:$C$1746,'CETAK NOTA'!$D$6:$D$21:'CETAK NOTA'!$D$1730:$D$1746,G95,'CETAK NOTA'!$B$6:$B$21:'CETAK NOTA'!$B$1730:$B$1746,B95)","v":0}]
[null,null,"",{"$f":"SUMIFS('CETAK NOTA'!$C$6:$C$21:'CETAK NOTA'!$C$1730:$C$1746,'CETAK NOTA'!$D$6:$D$21:'CETAK NOTA'!$D$1730:$D$1746,E96,'CETAK NOTA'!$B$6:$B$21:'CETAK NOTA'!$B$1730:$B$1746,B96)","v":0},null,{"$f":"SUMIFS('CETAK NOTA'!$C$6:$C$21:'CETAK NOTA'!$C$1730:$C$1746,'CETAK NOTA'!$D$6:$D$21:'CETAK NOTA'!$D$1730:$D$1746,G96,'CETAK NOTA'!$B$6:$B$21:'CETAK NOTA'!$B$1730:$B$1746,B96)","v":0}]
[null,null,"",{"$f":"SUMIFS('CETAK NOTA'!$C$6:$C$21:'CETAK NOTA'!$C$1730:$C$1746,'CETAK NOTA'!$D$6:$D$21:'CETAK NOTA'!$D$1730:$D$1746,E97,'CETAK NOTA'!$B$6:$B$21:'CETAK NOTA'!$B$1730:$B$1746,B97)","v":0},null,{"$f":"SUMIFS('CETAK NOTA'!$C$6:$C$21:'CETAK NOTA'!$C$1730:$C$1746,'CETAK NOTA'!$D$6:$D$21:'CETAK NOTA'!$D$1730:$D$1746,G97,'CETAK NOTA'!$B$6:$B$21:'CETAK NOTA'!$B$1730:$B$1746,B97)","v":0}]
[null,null,"",{"$f":"SUMIFS('CETAK NOTA'!$C$6:$C$21:'CETAK NOTA'!$C$1730:$C$1746,'CETAK NOTA'!$D$6:$D$21:'CETAK NOTA'!$D$1730:$D$1746,E98,'CETAK NOTA'!$B$6:$B$21:'CETAK NOTA'!$B$1730:$B$1746,B98)","v":0},null,{"$f":"SUMIFS('CETAK NOTA'!$C$6:$C$21:'CETAK NOTA'!$C$1730:$C$1746,'CETAK NOTA'!$D$6:$D$21:'CETAK NOTA'!$D$1730:$D$1746,G98,'CETAK NOTA'!$B$6:$B$21:'CETAK NOTA'!$B$1730:$B$1746,B98)","v":0}]
[null,null,"",{"$f":"SUMIFS('CETAK NOTA'!$C$6:$C$21:'CETAK NOTA'!$C$1730:$C$1746,'CETAK NOTA'!$D$6:$D$21:'CETAK NOTA'!$D$1730:$D$1746,E99,'CETAK NOTA'!$B$6:$B$21:'CETAK NOTA'!$B$1730:$B$1746,B99)","v":0},null,{"$f":"SUMIFS('CETAK NOTA'!$C$6:$C$21:'CETAK NOTA'!$C$1730:$C$1746,'CETAK NOTA'!$D$6:$D$21:'CETAK NOTA'!$D$1730:$D$1746,G99,'CETAK NOTA'!$B$6:$B$21:'CETAK NOTA'!$B$1730:$B$1746,B99)","v":0}]
[null,null,"",{"$f":"SUMIFS('CETAK NOTA'!$C$6:$C$21:'CETAK NOTA'!$C$1730:$C$1746,'CETAK NOTA'!$D$6:$D$21:'CETAK NOTA'!$D$1730:$D$1746,E100,'CETAK NOTA'!$B$6:$B$21:'CETAK NOTA'!$B$1730:$B$1746,B100)","v":0},null,{"$f":"SUMIFS('CETAK NOTA'!$C$6:$C$21:'CETAK NOTA'!$C$1730:$C$1746,'CETAK NOTA'!$D$6:$D$21:'CETAK NOTA'!$D$1730:$D$1746,G100,'CETAK NOTA'!$B$6:$B$21:'CETAK NOTA'!$B$1730:$B$1746,B100)","v":0}]
[null,null,"",{"$f":"SUMIFS('CETAK NOTA'!$C$6:$C$21:'CETAK NOTA'!$C$1730:$C$1746,'CETAK NOTA'!$D$6:$D$21:'CETAK NOTA'!$D$1730:$D$1746,E101,'CETAK NOTA'!$B$6:$B$21:'CETAK NOTA'!$B$1730:$B$1746,B101)","v":0},null,{"$f":"SUMIFS('CETAK NOTA'!$C$6:$C$21:'CETAK NOTA'!$C$1730:$C$1746,'CETAK NOTA'!$D$6:$D$21:'CETAK NOTA'!$D$1730:$D$1746,G101,'CETAK NOTA'!$B$6:$B$21:'CETAK NOTA'!$B$1730:$B$1746,B101)","v":0}]
[null,null,"",{"$f":"SUMIFS('CETAK NOTA'!$C$6:$C$21:'CETAK NOTA'!$C$1730:$C$1746,'CETAK NOTA'!$D$6:$D$21:'CETAK NOTA'!$D$1730:$D$1746,E102,'CETAK NOTA'!$B$6:$B$21:'CETAK NOTA'!$B$1730:$B$1746,B102)","v":0},null,{"$f":"SUMIFS('CETAK NOTA'!$C$6:$C$21:'CETAK NOTA'!$C$1730:$C$1746,'CETAK NOTA'!$D$6:$D$21:'CETAK NOTA'!$D$1730:$D$1746,G102,'CETAK NOTA'!$B$6:$B$21:'CETAK NOTA'!$B$1730:$B$1746,B102)","v":0}]
[null,null,"",{"$f":"SUMIFS('CETAK NOTA'!$C$6:$C$21:'CETAK NOTA'!$C$1730:$C$1746,'CETAK NOTA'!$D$6:$D$21:'CETAK NOTA'!$D$1730:$D$1746,E103,'CETAK NOTA'!$B$6:$B$21:'CETAK NOTA'!$B$1730:$B$1746,B103)","v":0},null,{"$f":"SUMIFS('CETAK NOTA'!$C$6:$C$21:'CETAK NOTA'!$C$1730:$C$1746,'CETAK NOTA'!$D$6:$D$21:'CETAK NOTA'!$D$1730:$D$1746,G103,'CETAK NOTA'!$B$6:$B$21:'CETAK NOTA'!$B$1730:$B$1746,B103)","v":0}]
[null,null,"",{"$f":"SUMIFS('CETAK NOTA'!$C$6:$C$21:'CETAK NOTA'!$C$1730:$C$1746,'CETAK NOTA'!$D$6:$D$21:'CETAK NOTA'!$D$1730:$D$1746,E104,'CETAK NOTA'!$B$6:$B$21:'CETAK NOTA'!$B$1730:$B$1746,B104)","v":0},null,{"$f":"SUMIFS('CETAK NOTA'!$C$6:$C$21:'CETAK NOTA'!$C$1730:$C$1746,'CETAK NOTA'!$D$6:$D$21:'CETAK NOTA'!$D$1730:$D$1746,G104,'CETAK NOTA'!$B$6:$B$21:'CETAK NOTA'!$B$1730:$B$1746,B104)","v":0}]
[null,null,"",{"$f":"SUMIFS('CETAK NOTA'!$C$6:$C$21:'CETAK NOTA'!$C$1730:$C$1746,'CETAK NOTA'!$D$6:$D$21:'CETAK NOTA'!$D$1730:$D$1746,E105,'CETAK NOTA'!$B$6:$B$21:'CETAK NOTA'!$B$1730:$B$1746,B105)","v":0},null,{"$f":"SUMIFS('CETAK NOTA'!$C$6:$C$21:'CETAK NOTA'!$C$1730:$C$1746,'CETAK NOTA'!$D$6:$D$21:'CETAK NOTA'!$D$1730:$D$1746,G105,'CETAK NOTA'!$B$6:$B$21:'CETAK NOTA'!$B$1730:$B$1746,B105)","v":0}]
[null,null,"",{"$f":"SUMIFS('CETAK NOTA'!$C$6:$C$21:'CETAK NOTA'!$C$1730:$C$1746,'CETAK NOTA'!$D$6:$D$21:'CETAK NOTA'!$D$1730:$D$1746,E106,'CETAK NOTA'!$B$6:$B$21:'CETAK NOTA'!$B$1730:$B$1746,B106)","v":0},null,{"$f":"SUMIFS('CETAK NOTA'!$C$6:$C$21:'CETAK NOTA'!$C$1730:$C$1746,'CETAK NOTA'!$D$6:$D$21:'CETAK NOTA'!$D$1730:$D$1746,G106,'CETAK NOTA'!$B$6:$B$21:'CETAK NOTA'!$B$1730:$B$1746,B106)","v":0}]
[null,null,"",{"$f":"SUMIFS('CETAK NOTA'!$C$6:$C$21:'CETAK NOTA'!$C$1730:$C$1746,'CETAK NOTA'!$D$6:$D$21:'CETAK NOTA'!$D$1730:$D$1746,E107,'CETAK NOTA'!$B$6:$B$21:'CETAK NOTA'!$B$1730:$B$1746,B107)","v":0},null,{"$f":"SUMIFS('CETAK NOTA'!$C$6:$C$21:'CETAK NOTA'!$C$1730:$C$1746,'CETAK NOTA'!$D$6:$D$21:'CETAK NOTA'!$D$1730:$D$1746,G107,'CETAK NOTA'!$B$6:$B$21:'CETAK NOTA'!$B$1730:$B$1746,B107)","v":0}]
[null,null,"",{"$f":"SUMIFS('CETAK NOTA'!$C$6:$C$21:'CETAK NOTA'!$C$1730:$C$1746,'CETAK NOTA'!$D$6:$D$21:'CETAK NOTA'!$D$1730:$D$1746,E108,'CETAK NOTA'!$B$6:$B$21:'CETAK NOTA'!$B$1730:$B$1746,B108)","v":0},null,{"$f":"SUMIFS('CETAK NOTA'!$C$6:$C$21:'CETAK NOTA'!$C$1730:$C$1746,'CETAK NOTA'!$D$6:$D$21:'CETAK NOTA'!$D$1730:$D$1746,G108,'CETAK NOTA'!$B$6:$B$21:'CETAK NOTA'!$B$1730:$B$1746,B108)","v":0}]
[null,null,"",{"$f":"SUMIFS('CETAK NOTA'!$C$6:$C$21:'CETAK NOTA'!$C$1730:$C$1746,'CETAK NOTA'!$D$6:$D$21:'CETAK NOTA'!$D$1730:$D$1746,E109,'CETAK NOTA'!$B$6:$B$21:'CETAK NOTA'!$B$1730:$B$1746,B109)","v":0},null,{"$f":"SUMIFS('CETAK NOTA'!$C$6:$C$21:'CETAK NOTA'!$C$1730:$C$1746,'CETAK NOTA'!$D$6:$D$21:'CETAK NOTA'!$D$1730:$D$1746,G109,'CETAK NOTA'!$B$6:$B$21:'CETAK NOTA'!$B$1730:$B$1746,B109)","v":0}]
[null,null,"",{"$f":"SUMIFS('CETAK NOTA'!$C$6:$C$21:'CETAK NOTA'!$C$1730:$C$1746,'CETAK NOTA'!$D$6:$D$21:'CETAK NOTA'!$D$1730:$D$1746,E110,'CETAK NOTA'!$B$6:$B$21:'CETAK NOTA'!$B$1730:$B$1746,B110)","v":0},null,{"$f":"SUMIFS('CETAK NOTA'!$C$6:$C$21:'CETAK NOTA'!$C$1730:$C$1746,'CETAK NOTA'!$D$6:$D$21:'CETAK NOTA'!$D$1730:$D$1746,G110,'CETAK NOTA'!$B$6:$B$21:'CETAK NOTA'!$B$1730:$B$1746,B110)","v":0}]
[null,null,"",{"$f":"SUMIFS('CETAK NOTA'!$C$6:$C$21:'CETAK NOTA'!$C$1730:$C$1746,'CETAK NOTA'!$D$6:$D$21:'CETAK NOTA'!$D$1730:$D$1746,E111,'CETAK NOTA'!$B$6:$B$21:'CETAK NOTA'!$B$1730:$B$1746,B111)","v":0},null,{"$f":"SUMIFS('CETAK NOTA'!$C$6:$C$21:'CETAK NOTA'!$C$1730:$C$1746,'CETAK NOTA'!$D$6:$D$21:'CETAK NOTA'!$D$1730:$D$1746,G111,'CETAK NOTA'!$B$6:$B$21:'CETAK NOTA'!$B$1730:$B$1746,B111)","v":0}]
[null,null,"",{"$f":"SUMIFS('CETAK NOTA'!$C$6:$C$21:'CETAK NOTA'!$C$1730:$C$1746,'CETAK NOTA'!$D$6:$D$21:'CETAK NOTA'!$D$1730:$D$1746,E112,'CETAK NOTA'!$B$6:$B$21:'CETAK NOTA'!$B$1730:$B$1746,B112)","v":0},null,{"$f":"SUMIFS('CETAK NOTA'!$C$6:$C$21:'CETAK NOTA'!$C$1730:$C$1746,'CETAK NOTA'!$D$6:$D$21:'CETAK NOTA'!$D$1730:$D$1746,G112,'CETAK NOTA'!$B$6:$B$21:'CETAK NOTA'!$B$1730:$B$1746,B112)","v":0}]
[null,null,"",{"$f":"SUMIFS('CETAK NOTA'!$C$6:$C$21:'CETAK NOTA'!$C$1730:$C$1746,'CETAK NOTA'!$D$6:$D$21:'CETAK NOTA'!$D$1730:$D$1746,E113,'CETAK NOTA'!$B$6:$B$21:'CETAK NOTA'!$B$1730:$B$1746,B113)","v":0},null,{"$f":"SUMIFS('CETAK NOTA'!$C$6:$C$21:'CETAK NOTA'!$C$1730:$C$1746,'CETAK NOTA'!$D$6:$D$21:'CETAK NOTA'!$D$1730:$D$1746,G113,'CETAK NOTA'!$B$6:$B$21:'CETAK NOTA'!$B$1730:$B$1746,B113)","v":0}]
[null,null,"",{"$f":"SUMIFS('CETAK NOTA'!$C$6:$C$21:'CETAK NOTA'!$C$1730:$C$1746,'CETAK NOTA'!$D$6:$D$21:'CETAK NOTA'!$D$1730:$D$1746,E114,'CETAK NOTA'!$B$6:$B$21:'CETAK NOTA'!$B$1730:$B$1746,B114)","v":0},null,{"$f":"SUMIFS('CETAK NOTA'!$C$6:$C$21:'CETAK NOTA'!$C$1730:$C$1746,'CETAK NOTA'!$D$6:$D$21:'CETAK NOTA'!$D$1730:$D$1746,G114,'CETAK NOTA'!$B$6:$B$21:'CETAK NOTA'!$B$1730:$B$1746,B114)","v":0}]
[null,null,"",{"$f":"SUMIFS('CETAK NOTA'!$C$6:$C$21:'CETAK NOTA'!$C$1730:$C$1746,'CETAK NOTA'!$D$6:$D$21:'CETAK NOTA'!$D$1730:$D$1746,E115,'CETAK NOTA'!$B$6:$B$21:'CETAK NOTA'!$B$1730:$B$1746,B115)","v":0},null,{"$f":"SUMIFS('CETAK NOTA'!$C$6:$C$21:'CETAK NOTA'!$C$1730:$C$1746,'CETAK NOTA'!$D$6:$D$21:'CETAK NOTA'!$D$1730:$D$1746,G115,'CETAK NOTA'!$B$6:$B$21:'CETAK NOTA'!$B$1730:$B$1746,B115)","v":0}]
[null,null,"",{"$f":"SUMIFS('CETAK NOTA'!$C$6:$C$21:'CETAK NOTA'!$C$1730:$C$1746,'CETAK NOTA'!$D$6:$D$21:'CETAK NOTA'!$D$1730:$D$1746,E116,'CETAK NOTA'!$B$6:$B$21:'CETAK NOTA'!$B$1730:$B$1746,B116)","v":0},null,{"$f":"SUMIFS('CETAK NOTA'!$C$6:$C$21:'CETAK NOTA'!$C$1730:$C$1746,'CETAK NOTA'!$D$6:$D$21:'CETAK NOTA'!$D$1730:$D$1746,G116,'CETAK NOTA'!$B$6:$B$21:'CETAK NOTA'!$B$1730:$B$1746,B116)","v":0}]
[null,null,"",{"$f":"SUMIFS('CETAK NOTA'!$C$6:$C$21:'CETAK NOTA'!$C$1730:$C$1746,'CETAK NOTA'!$D$6:$D$21:'CETAK NOTA'!$D$1730:$D$1746,E117,'CETAK NOTA'!$B$6:$B$21:'CETAK NOTA'!$B$1730:$B$1746,B117)","v":0},null,{"$f":"SUMIFS('CETAK NOTA'!$C$6:$C$21:'CETAK NOTA'!$C$1730:$C$1746,'CETAK NOTA'!$D$6:$D$21:'CETAK NOTA'!$D$1730:$D$1746,G117,'CETAK NOTA'!$B$6:$B$21:'CETAK NOTA'!$B$1730:$B$1746,B117)","v":0}]
[null,null,"",{"$f":"SUMIFS('CETAK NOTA'!$C$6:$C$21:'CETAK NOTA'!$C$1730:$C$1746,'CETAK NOTA'!$D$6:$D$21:'CETAK NOTA'!$D$1730:$D$1746,E118,'CETAK NOTA'!$B$6:$B$21:'CETAK NOTA'!$B$1730:$B$1746,B118)","v":0},null,{"$f":"SUMIFS('CETAK NOTA'!$C$6:$C$21:'CETAK NOTA'!$C$1730:$C$1746,'CETAK NOTA'!$D$6:$D$21:'CETAK NOTA'!$D$1730:$D$1746,G118,'CETAK NOTA'!$B$6:$B$21:'CETAK NOTA'!$B$1730:$B$1746,B118)","v":0}]
[null,null,"",{"$f":"SUMIFS('CETAK NOTA'!$C$6:$C$21:'CETAK NOTA'!$C$1730:$C$1746,'CETAK NOTA'!$D$6:$D$21:'CETAK NOTA'!$D$1730:$D$1746,E119,'CETAK NOTA'!$B$6:$B$21:'CETAK NOTA'!$B$1730:$B$1746,B119)","v":0},null,{"$f":"SUMIFS('CETAK NOTA'!$C$6:$C$21:'CETAK NOTA'!$C$1730:$C$1746,'CETAK NOTA'!$D$6:$D$21:'CETAK NOTA'!$D$1730:$D$1746,G119,'CETAK NOTA'!$B$6:$B$21:'CETAK NOTA'!$B$1730:$B$1746,B119)","v":0}]
[null,null,"",{"$f":"SUMIFS('CETAK NOTA'!$C$6:$C$21:'CETAK NOTA'!$C$1730:$C$1746,'CETAK NOTA'!$D$6:$D$21:'CETAK NOTA'!$D$1730:$D$1746,E120,'CETAK NOTA'!$B$6:$B$21:'CETAK NOTA'!$B$1730:$B$1746,B120)","v":0},null,{"$f":"SUMIFS('CETAK NOTA'!$C$6:$C$21:'CETAK NOTA'!$C$1730:$C$1746,'CETAK NOTA'!$D$6:$D$21:'CETAK NOTA'!$D$1730:$D$1746,G120,'CETAK NOTA'!$B$6:$B$21:'CETAK NOTA'!$B$1730:$B$1746,B120)","v":0}]
[null,null,"",{"$f":"SUMIFS('CETAK NOTA'!$C$6:$C$21:'CETAK NOTA'!$C$1730:$C$1746,'CETAK NOTA'!$D$6:$D$21:'CETAK NOTA'!$D$1730:$D$1746,E121,'CETAK NOTA'!$B$6:$B$21:'CETAK NOTA'!$B$1730:$B$1746,B121)","v":0},null,{"$f":"SUMIFS('CETAK NOTA'!$C$6:$C$21:'CETAK NOTA'!$C$1730:$C$1746,'CETAK NOTA'!$D$6:$D$21:'CETAK NOTA'!$D$1730:$D$1746,G121,'CETAK NOTA'!$B$6:$B$21:'CETAK NOTA'!$B$1730:$B$1746,B121)","v":0}]
[null,null,"",{"$f":"SUMIFS('CETAK NOTA'!$C$6:$C$21:'CETAK NOTA'!$C$1730:$C$1746,'CETAK NOTA'!$D$6:$D$21:'CETAK NOTA'!$D$1730:$D$1746,E122,'CETAK NOTA'!$B$6:$B$21:'CETAK NOTA'!$B$1730:$B$1746,B122)","v":0},null,{"$f":"SUMIFS('CETAK NOTA'!$C$6:$C$21:'CETAK NOTA'!$C$1730:$C$1746,'CETAK NOTA'!$D$6:$D$21:'CETAK NOTA'!$D$1730:$D$1746,G122,'CETAK NOTA'!$B$6:$B$21:'CETAK NOTA'!$B$1730:$B$1746,B122)","v":0}]
[null,null,"",{"$f":"SUMIFS('CETAK NOTA'!$C$6:$C$21:'CETAK NOTA'!$C$1730:$C$1746,'CETAK NOTA'!$D$6:$D$21:'CETAK NOTA'!$D$1730:$D$1746,E123,'CETAK NOTA'!$B$6:$B$21:'CETAK NOTA'!$B$1730:$B$1746,B123)","v":0},null,{"$f":"SUMIFS('CETAK NOTA'!$C$6:$C$21:'CETAK NOTA'!$C$1730:$C$1746,'CETAK NOTA'!$D$6:$D$21:'CETAK NOTA'!$D$1730:$D$1746,G123,'CETAK NOTA'!$B$6:$B$21:'CETAK NOTA'!$B$1730:$B$1746,B123)","v":0}]
[null,null,"",{"$f":"SUMIFS('CETAK NOTA'!$C$6:$C$21:'CETAK NOTA'!$C$1730:$C$1746,'CETAK NOTA'!$D$6:$D$21:'CETAK NOTA'!$D$1730:$D$1746,E124,'CETAK NOTA'!$B$6:$B$21:'CETAK NOTA'!$B$1730:$B$1746,B124)","v":0},null,{"$f":"SUMIFS('CETAK NOTA'!$C$6:$C$21:'CETAK NOTA'!$C$1730:$C$1746,'CETAK NOTA'!$D$6:$D$21:'CETAK NOTA'!$D$1730:$D$1746,G124,'CETAK NOTA'!$B$6:$B$21:'CETAK NOTA'!$B$1730:$B$1746,B124)","v":0}]
[null,null,"",{"$f":"SUMIFS('CETAK NOTA'!$C$6:$C$21:'CETAK NOTA'!$C$1730:$C$1746,'CETAK NOTA'!$D$6:$D$21:'CETAK NOTA'!$D$1730:$D$1746,E125,'CETAK NOTA'!$B$6:$B$21:'CETAK NOTA'!$B$1730:$B$1746,B125)","v":0},null,{"$f":"SUMIFS('CETAK NOTA'!$C$6:$C$21:'CETAK NOTA'!$C$1730:$C$1746,'CETAK NOTA'!$D$6:$D$21:'CETAK NOTA'!$D$1730:$D$1746,G125,'CETAK NOTA'!$B$6:$B$21:'CETAK NOTA'!$B$1730:$B$1746,B125)","v":0}]
[null,null,"",{"$f":"SUMIFS('CETAK NOTA'!$C$6:$C$21:'CETAK NOTA'!$C$1730:$C$1746,'CETAK NOTA'!$D$6:$D$21:'CETAK NOTA'!$D$1730:$D$1746,E126,'CETAK NOTA'!$B$6:$B$21:'CETAK NOTA'!$B$1730:$B$1746,B126)","v":0},null,{"$f":"SUMIFS('CETAK NOTA'!$C$6:$C$21:'CETAK NOTA'!$C$1730:$C$1746,'CETAK NOTA'!$D$6:$D$21:'CETAK NOTA'!$D$1730:$D$1746,G126,'CETAK NOTA'!$B$6:$B$21:'CETAK NOTA'!$B$1730:$B$1746,B126)","v":0}]
[null,null,"",{"$f":"SUMIFS('CETAK NOTA'!$C$6:$C$21:'CETAK NOTA'!$C$1730:$C$1746,'CETAK NOTA'!$D$6:$D$21:'CETAK NOTA'!$D$1730:$D$1746,E127,'CETAK NOTA'!$B$6:$B$21:'CETAK NOTA'!$B$1730:$B$1746,B127)","v":0},null,{"$f":"SUMIFS('CETAK NOTA'!$C$6:$C$21:'CETAK NOTA'!$C$1730:$C$1746,'CETAK NOTA'!$D$6:$D$21:'CETAK NOTA'!$D$1730:$D$1746,G127,'CETAK NOTA'!$B$6:$B$21:'CETAK NOTA'!$B$1730:$B$1746,B127)","v":0}]
[null,null,"",{"$f":"SUMIFS('CETAK NOTA'!$C$6:$C$21:'CETAK NOTA'!$C$1730:$C$1746,'CETAK NOTA'!$D$6:$D$21:'CETAK NOTA'!$D$1730:$D$1746,E128,'CETAK NOTA'!$B$6:$B$21:'CETAK NOTA'!$B$1730:$B$1746,B128)","v":0},null,{"$f":"SUMIFS('CETAK NOTA'!$C$6:$C$21:'CETAK NOTA'!$C$1730:$C$1746,'CETAK NOTA'!$D$6:$D$21:'CETAK NOTA'!$D$1730:$D$1746,G128,'CETAK NOTA'!$B$6:$B$21:'CETAK NOTA'!$B$1730:$B$1746,B128)","v":0}]
[null,null,"",{"$f":"SUMIFS('CETAK NOTA'!$C$6:$C$21:'CETAK NOTA'!$C$1730:$C$1746,'CETAK NOTA'!$D$6:$D$21:'CETAK NOTA'!$D$1730:$D$1746,E129,'CETAK NOTA'!$B$6:$B$21:'CETAK NOTA'!$B$1730:$B$1746,B129)","v":0},null,{"$f":"SUMIFS('CETAK NOTA'!$C$6:$C$21:'CETAK NOTA'!$C$1730:$C$1746,'CETAK NOTA'!$D$6:$D$21:'CETAK NOTA'!$D$1730:$D$1746,G129,'CETAK NOTA'!$B$6:$B$21:'CETAK NOTA'!$B$1730:$B$1746,B129)","v":0}]
[null,null,{"$f":"IF(AND(K130=0,L130=0),\"\",IF(AND(D130>0,K130>L130),\"RM\",\"TK\"))","v":""},{"$f":"SUMIFS('CETAK NOTA'!$C$6:$C$21:'CETAK NOTA'!$C$1730:$C$1746,'CETAK NOTA'!$D$6:$D$21:'CETAK NOTA'!$D$1730:$D$1746,E130,'CETAK NOTA'!$B$6:$B$21:'CETAK NOTA'!$B$1730:$B$1746,B130)","v":0},null,{"$f":"SUMIFS('CETAK NOTA'!$C$6:$C$21:'CETAK NOTA'!$C$1730:$C$1746,'CETAK NOTA'!$D$6:$D$21:'CETAK NOTA'!$D$1730:$D$1746,G130,'CETAK NOTA'!$B$6:$B$21:'CETAK NOTA'!$B$1730:$B$1746,B130)","v":0}]
[null,null,"",{"$f":"SUMIFS('CETAK NOTA'!$C$6:$C$21:'CETAK NOTA'!$C$1730:$C$1746,'CETAK NOTA'!$D$6:$D$21:'CETAK NOTA'!$D$1730:$D$1746,E131,'CETAK NOTA'!$B$6:$B$21:'CETAK NOTA'!$B$1730:$B$1746,B131)","v":0},null,{"$f":"SUMIFS('CETAK NOTA'!$C$6:$C$21:'CETAK NOTA'!$C$1730:$C$1746,'CETAK NOTA'!$D$6:$D$21:'CETAK NOTA'!$D$1730:$D$1746,G131,'CETAK NOTA'!$B$6:$B$21:'CETAK NOTA'!$B$1730:$B$1746,B131)","v":0}]
[null,null,"",{"$f":"SUMIFS('CETAK NOTA'!$C$6:$C$21:'CETAK NOTA'!$C$1730:$C$1746,'CETAK NOTA'!$D$6:$D$21:'CETAK NOTA'!$D$1730:$D$1746,E132,'CETAK NOTA'!$B$6:$B$21:'CETAK NOTA'!$B$1730:$B$1746,B132)","v":0},null,{"$f":"SUMIFS('CETAK NOTA'!$C$6:$C$21:'CETAK NOTA'!$C$1730:$C$1746,'CETAK NOTA'!$D$6:$D$21:'CETAK NOTA'!$D$1730:$D$1746,G132,'CETAK NOTA'!$B$6:$B$21:'CETAK NOTA'!$B$1730:$B$1746,B132)","v":0}]
[null,null,"",{"$f":"SUMIFS('CETAK NOTA'!$C$6:$C$21:'CETAK NOTA'!$C$1730:$C$1746,'CETAK NOTA'!$D$6:$D$21:'CETAK NOTA'!$D$1730:$D$1746,E133,'CETAK NOTA'!$B$6:$B$21:'CETAK NOTA'!$B$1730:$B$1746,B133)","v":0},null,{"$f":"SUMIFS('CETAK NOTA'!$C$6:$C$21:'CETAK NOTA'!$C$1730:$C$1746,'CETAK NOTA'!$D$6:$D$21:'CETAK NOTA'!$D$1730:$D$1746,G133,'CETAK NOTA'!$B$6:$B$21:'CETAK NOTA'!$B$1730:$B$1746,B133)","v":0}]
[null,null,"",{"$f":"SUMIFS('CETAK NOTA'!$C$6:$C$21:'CETAK NOTA'!$C$1730:$C$1746,'CETAK NOTA'!$D$6:$D$21:'CETAK NOTA'!$D$1730:$D$1746,E134,'CETAK NOTA'!$B$6:$B$21:'CETAK NOTA'!$B$1730:$B$1746,B134)","v":0},null,{"$f":"SUMIFS('CETAK NOTA'!$C$6:$C$21:'CETAK NOTA'!$C$1730:$C$1746,'CETAK NOTA'!$D$6:$D$21:'CETAK NOTA'!$D$1730:$D$1746,G134,'CETAK NOTA'!$B$6:$B$21:'CETAK NOTA'!$B$1730:$B$1746,B134)","v":0}]
[null,null,"",{"$f":"SUMIFS('CETAK NOTA'!$C$6:$C$21:'CETAK NOTA'!$C$1730:$C$1746,'CETAK NOTA'!$D$6:$D$21:'CETAK NOTA'!$D$1730:$D$1746,E135,'CETAK NOTA'!$B$6:$B$21:'CETAK NOTA'!$B$1730:$B$1746,B135)","v":0},null,{"$f":"SUMIFS('CETAK NOTA'!$C$6:$C$21:'CETAK NOTA'!$C$1730:$C$1746,'CETAK NOTA'!$D$6:$D$21:'CETAK NOTA'!$D$1730:$D$1746,G135,'CETAK NOTA'!$B$6:$B$21:'CETAK NOTA'!$B$1730:$B$1746,B135)","v":0}]
[null,null,"",{"$f":"SUMIFS('CETAK NOTA'!$C$6:$C$21:'CETAK NOTA'!$C$1730:$C$1746,'CETAK NOTA'!$D$6:$D$21:'CETAK NOTA'!$D$1730:$D$1746,E136,'CETAK NOTA'!$B$6:$B$21:'CETAK NOTA'!$B$1730:$B$1746,B136)","v":0},null,{"$f":"SUMIFS('CETAK NOTA'!$C$6:$C$21:'CETAK NOTA'!$C$1730:$C$1746,'CETAK NOTA'!$D$6:$D$21:'CETAK NOTA'!$D$1730:$D$1746,G136,'CETAK NOTA'!$B$6:$B$21:'CETAK NOTA'!$B$1730:$B$1746,B136)","v":0}]
[null,null,"",{"$f":"SUMIFS('CETAK NOTA'!$C$6:$C$21:'CETAK NOTA'!$C$1730:$C$1746,'CETAK NOTA'!$D$6:$D$21:'CETAK NOTA'!$D$1730:$D$1746,E137,'CETAK NOTA'!$B$6:$B$21:'CETAK NOTA'!$B$1730:$B$1746,B137)","v":0},null,{"$f":"SUMIFS('CETAK NOTA'!$C$6:$C$21:'CETAK NOTA'!$C$1730:$C$1746,'CETAK NOTA'!$D$6:$D$21:'CETAK NOTA'!$D$1730:$D$1746,G137,'CETAK NOTA'!$B$6:$B$21:'CETAK NOTA'!$B$1730:$B$1746,B137)","v":0}]
[null,null,"",{"$f":"SUMIFS('CETAK NOTA'!$C$6:$C$21:'CETAK NOTA'!$C$1730:$C$1746,'CETAK NOTA'!$D$6:$D$21:'CETAK NOTA'!$D$1730:$D$1746,E138,'CETAK NOTA'!$B$6:$B$21:'CETAK NOTA'!$B$1730:$B$1746,B138)","v":0},null,{"$f":"SUMIFS('CETAK NOTA'!$C$6:$C$21:'CETAK NOTA'!$C$1730:$C$1746,'CETAK NOTA'!$D$6:$D$21:'CETAK NOTA'!$D$1730:$D$1746,G138,'CETAK NOTA'!$B$6:$B$21:'CETAK NOTA'!$B$1730:$B$1746,B138)","v":0}]
[null,null,"",{"$f":"SUMIFS('CETAK NOTA'!$C$6:$C$21:'CETAK NOTA'!$C$1730:$C$1746,'CETAK NOTA'!$D$6:$D$21:'CETAK NOTA'!$D$1730:$D$1746,E139,'CETAK NOTA'!$B$6:$B$21:'CETAK NOTA'!$B$1730:$B$1746,B139)","v":0},null,{"$f":"SUMIFS('CETAK NOTA'!$C$6:$C$21:'CETAK NOTA'!$C$1730:$C$1746,'CETAK NOTA'!$D$6:$D$21:'CETAK NOTA'!$D$1730:$D$1746,G139,'CETAK NOTA'!$B$6:$B$21:'CETAK NOTA'!$B$1730:$B$1746,B139)","v":0}]
[null,null,"",{"$f":"SUMIFS('CETAK NOTA'!$C$6:$C$21:'CETAK NOTA'!$C$1730:$C$1746,'CETAK NOTA'!$D$6:$D$21:'CETAK NOTA'!$D$1730:$D$1746,E140,'CETAK NOTA'!$B$6:$B$21:'CETAK NOTA'!$B$1730:$B$1746,B140)","v":0},null,{"$f":"SUMIFS('CETAK NOTA'!$C$6:$C$21:'CETAK NOTA'!$C$1730:$C$1746,'CETAK NOTA'!$D$6:$D$21:'CETAK NOTA'!$D$1730:$D$1746,G140,'CETAK NOTA'!$B$6:$B$21:'CETAK NOTA'!$B$1730:$B$1746,B140)","v":0}]
[null,null,"",{"$f":"SUMIFS('CETAK NOTA'!$C$6:$C$21:'CETAK NOTA'!$C$1730:$C$1746,'CETAK NOTA'!$D$6:$D$21:'CETAK NOTA'!$D$1730:$D$1746,E141,'CETAK NOTA'!$B$6:$B$21:'CETAK NOTA'!$B$1730:$B$1746,B141)","v":0},null,{"$f":"SUMIFS('CETAK NOTA'!$C$6:$C$21:'CETAK NOTA'!$C$1730:$C$1746,'CETAK NOTA'!$D$6:$D$21:'CETAK NOTA'!$D$1730:$D$1746,G141,'CETAK NOTA'!$B$6:$B$21:'CETAK NOTA'!$B$1730:$B$1746,B141)","v":0}]
[null,null,"",{"$f":"SUMIFS('CETAK NOTA'!$C$6:$C$21:'CETAK NOTA'!$C$1730:$C$1746,'CETAK NOTA'!$D$6:$D$21:'CETAK NOTA'!$D$1730:$D$1746,E142,'CETAK NOTA'!$B$6:$B$21:'CETAK NOTA'!$B$1730:$B$1746,B142)","v":0},null,{"$f":"SUMIFS('CETAK NOTA'!$C$6:$C$21:'CETAK NOTA'!$C$1730:$C$1746,'CETAK NOTA'!$D$6:$D$21:'CETAK NOTA'!$D$1730:$D$1746,G142,'CETAK NOTA'!$B$6:$B$21:'CETAK NOTA'!$B$1730:$B$1746,B142)","v":0}]
[null,null,"",{"$f":"SUMIFS('CETAK NOTA'!$C$6:$C$21:'CETAK NOTA'!$C$1730:$C$1746,'CETAK NOTA'!$D$6:$D$21:'CETAK NOTA'!$D$1730:$D$1746,E143,'CETAK NOTA'!$B$6:$B$21:'CETAK NOTA'!$B$1730:$B$1746,B143)","v":0},null,{"$f":"SUMIFS('CETAK NOTA'!$C$6:$C$21:'CETAK NOTA'!$C$1730:$C$1746,'CETAK NOTA'!$D$6:$D$21:'CETAK NOTA'!$D$1730:$D$1746,G143,'CETAK NOTA'!$B$6:$B$21:'CETAK NOTA'!$B$1730:$B$1746,B143)","v":0}]
[null,null,"",{"$f":"SUMIFS('CETAK NOTA'!$C$6:$C$21:'CETAK NOTA'!$C$1730:$C$1746,'CETAK NOTA'!$D$6:$D$21:'CETAK NOTA'!$D$1730:$D$1746,E144,'CETAK NOTA'!$B$6:$B$21:'CETAK NOTA'!$B$1730:$B$1746,B144)","v":0},null,{"$f":"SUMIFS('CETAK NOTA'!$C$6:$C$21:'CETAK NOTA'!$C$1730:$C$1746,'CETAK NOTA'!$D$6:$D$21:'CETAK NOTA'!$D$1730:$D$1746,G144,'CETAK NOTA'!$B$6:$B$21:'CETAK NOTA'!$B$1730:$B$1746,B144)","v":0}]
[null,null,"",{"$f":"SUMIFS('CETAK NOTA'!$C$6:$C$21:'CETAK NOTA'!$C$1730:$C$1746,'CETAK NOTA'!$D$6:$D$21:'CETAK NOTA'!$D$1730:$D$1746,E145,'CETAK NOTA'!$B$6:$B$21:'CETAK NOTA'!$B$1730:$B$1746,B145)","v":0},null,{"$f":"SUMIFS('CETAK NOTA'!$C$6:$C$21:'CETAK NOTA'!$C$1730:$C$1746,'CETAK NOTA'!$D$6:$D$21:'CETAK NOTA'!$D$1730:$D$1746,G145,'CETAK NOTA'!$B$6:$B$21:'CETAK NOTA'!$B$1730:$B$1746,B145)","v":0}]
[null,null,"",{"$f":"SUMIFS('CETAK NOTA'!$C$6:$C$21:'CETAK NOTA'!$C$1730:$C$1746,'CETAK NOTA'!$D$6:$D$21:'CETAK NOTA'!$D$1730:$D$1746,E146,'CETAK NOTA'!$B$6:$B$21:'CETAK NOTA'!$B$1730:$B$1746,B146)","v":0},null,{"$f":"SUMIFS('CETAK NOTA'!$C$6:$C$21:'CETAK NOTA'!$C$1730:$C$1746,'CETAK NOTA'!$D$6:$D$21:'CETAK NOTA'!$D$1730:$D$1746,G146,'CETAK NOTA'!$B$6:$B$21:'CETAK NOTA'!$B$1730:$B$1746,B146)","v":0}]
[null,null,"",{"$f":"SUMIFS('CETAK NOTA'!$C$6:$C$21:'CETAK NOTA'!$C$1730:$C$1746,'CETAK NOTA'!$D$6:$D$21:'CETAK NOTA'!$D$1730:$D$1746,E147,'CETAK NOTA'!$B$6:$B$21:'CETAK NOTA'!$B$1730:$B$1746,B147)","v":0},null,{"$f":"SUMIFS('CETAK NOTA'!$C$6:$C$21:'CETAK NOTA'!$C$1730:$C$1746,'CETAK NOTA'!$D$6:$D$21:'CETAK NOTA'!$D$1730:$D$1746,G147,'CETAK NOTA'!$B$6:$B$21:'CETAK NOTA'!$B$1730:$B$1746,B147)","v":0}]
[null,null,"",{"$f":"SUMIFS('CETAK NOTA'!$C$6:$C$21:'CETAK NOTA'!$C$1730:$C$1746,'CETAK NOTA'!$D$6:$D$21:'CETAK NOTA'!$D$1730:$D$1746,E148,'CETAK NOTA'!$B$6:$B$21:'CETAK NOTA'!$B$1730:$B$1746,B148)","v":0},null,{"$f":"SUMIFS('CETAK NOTA'!$C$6:$C$21:'CETAK NOTA'!$C$1730:$C$1746,'CETAK NOTA'!$D$6:$D$21:'CETAK NOTA'!$D$1730:$D$1746,G148,'CETAK NOTA'!$B$6:$B$21:'CETAK NOTA'!$B$1730:$B$1746,B148)","v":0}]
[null,null,"",{"$f":"SUMIFS('CETAK NOTA'!$C$6:$C$21:'CETAK NOTA'!$C$1730:$C$1746,'CETAK NOTA'!$D$6:$D$21:'CETAK NOTA'!$D$1730:$D$1746,E149,'CETAK NOTA'!$B$6:$B$21:'CETAK NOTA'!$B$1730:$B$1746,B149)","v":0},null,{"$f":"SUMIFS('CETAK NOTA'!$C$6:$C$21:'CETAK NOTA'!$C$1730:$C$1746,'CETAK NOTA'!$D$6:$D$21:'CETAK NOTA'!$D$1730:$D$1746,G149,'CETAK NOTA'!$B$6:$B$21:'CETAK NOTA'!$B$1730:$B$1746,B149)","v":0}]
[null,null,"",{"$f":"SUMIFS('CETAK NOTA'!$C$6:$C$21:'CETAK NOTA'!$C$1730:$C$1746,'CETAK NOTA'!$D$6:$D$21:'CETAK NOTA'!$D$1730:$D$1746,E150,'CETAK NOTA'!$B$6:$B$21:'CETAK NOTA'!$B$1730:$B$1746,B150)","v":0},null,{"$f":"SUMIFS('CETAK NOTA'!$C$6:$C$21:'CETAK NOTA'!$C$1730:$C$1746,'CETAK NOTA'!$D$6:$D$21:'CETAK NOTA'!$D$1730:$D$1746,G150,'CETAK NOTA'!$B$6:$B$21:'CETAK NOTA'!$B$1730:$B$1746,B150)","v":0}]
[null,null,"",{"$f":"SUMIFS('CETAK NOTA'!$C$6:$C$21:'CETAK NOTA'!$C$1730:$C$1746,'CETAK NOTA'!$D$6:$D$21:'CETAK NOTA'!$D$1730:$D$1746,E151,'CETAK NOTA'!$B$6:$B$21:'CETAK NOTA'!$B$1730:$B$1746,B151)","v":0},null,{"$f":"SUMIFS('CETAK NOTA'!$C$6:$C$21:'CETAK NOTA'!$C$1730:$C$1746,'CETAK NOTA'!$D$6:$D$21:'CETAK NOTA'!$D$1730:$D$1746,G151,'CETAK NOTA'!$B$6:$B$21:'CETAK NOTA'!$B$1730:$B$1746,B151)","v":0}]
[null,null,"",{"$f":"SUMIFS('CETAK NOTA'!$C$6:$C$21:'CETAK NOTA'!$C$1730:$C$1746,'CETAK NOTA'!$D$6:$D$21:'CETAK NOTA'!$D$1730:$D$1746,E152,'CETAK NOTA'!$B$6:$B$21:'CETAK NOTA'!$B$1730:$B$1746,B152)","v":0},null,{"$f":"SUMIFS('CETAK NOTA'!$C$6:$C$21:'CETAK NOTA'!$C$1730:$C$1746,'CETAK NOTA'!$D$6:$D$21:'CETAK NOTA'!$D$1730:$D$1746,G152,'CETAK NOTA'!$B$6:$B$21:'CETAK NOTA'!$B$1730:$B$1746,B152)","v":0}]
[null,null,"",{"$f":"SUMIFS('CETAK NOTA'!$C$6:$C$21:'CETAK NOTA'!$C$1730:$C$1746,'CETAK NOTA'!$D$6:$D$21:'CETAK NOTA'!$D$1730:$D$1746,E153,'CETAK NOTA'!$B$6:$B$21:'CETAK NOTA'!$B$1730:$B$1746,B153)","v":0},null,{"$f":"SUMIFS('CETAK NOTA'!$C$6:$C$21:'CETAK NOTA'!$C$1730:$C$1746,'CETAK NOTA'!$D$6:$D$21:'CETAK NOTA'!$D$1730:$D$1746,G153,'CETAK NOTA'!$B$6:$B$21:'CETAK NOTA'!$B$1730:$B$1746,B153)","v":0}]
[null,null,"",{"$f":"SUMIFS('CETAK NOTA'!$C$6:$C$21:'CETAK NOTA'!$C$1730:$C$1746,'CETAK NOTA'!$D$6:$D$21:'CETAK NOTA'!$D$1730:$D$1746,E154,'CETAK NOTA'!$B$6:$B$21:'CETAK NOTA'!$B$1730:$B$1746,B154)","v":0},null,{"$f":"SUMIFS('CETAK NOTA'!$C$6:$C$21:'CETAK NOTA'!$C$1730:$C$1746,'CETAK NOTA'!$D$6:$D$21:'CETAK NOTA'!$D$1730:$D$1746,G154,'CETAK NOTA'!$B$6:$B$21:'CETAK NOTA'!$B$1730:$B$1746,B154)","v":0}]
[null,null,"",{"$f":"SUMIFS('CETAK NOTA'!$C$6:$C$21:'CETAK NOTA'!$C$1730:$C$1746,'CETAK NOTA'!$D$6:$D$21:'CETAK NOTA'!$D$1730:$D$1746,E155,'CETAK NOTA'!$B$6:$B$21:'CETAK NOTA'!$B$1730:$B$1746,B155)","v":0},null,{"$f":"SUMIFS('CETAK NOTA'!$C$6:$C$21:'CETAK NOTA'!$C$1730:$C$1746,'CETAK NOTA'!$D$6:$D$21:'CETAK NOTA'!$D$1730:$D$1746,G155,'CETAK NOTA'!$B$6:$B$21:'CETAK NOTA'!$B$1730:$B$1746,B155)","v":0}]
[null,null,"",{"$f":"SUMIFS('CETAK NOTA'!$C$6:$C$21:'CETAK NOTA'!$C$1730:$C$1746,'CETAK NOTA'!$D$6:$D$21:'CETAK NOTA'!$D$1730:$D$1746,E156,'CETAK NOTA'!$B$6:$B$21:'CETAK NOTA'!$B$1730:$B$1746,B156)","v":0},null,{"$f":"SUMIFS('CETAK NOTA'!$C$6:$C$21:'CETAK NOTA'!$C$1730:$C$1746,'CETAK NOTA'!$D$6:$D$21:'CETAK NOTA'!$D$1730:$D$1746,G156,'CETAK NOTA'!$B$6:$B$21:'CETAK NOTA'!$B$1730:$B$1746,B156)","v":0}]
[null,null,"",{"$f":"SUMIFS('CETAK NOTA'!$C$6:$C$21:'CETAK NOTA'!$C$1730:$C$1746,'CETAK NOTA'!$D$6:$D$21:'CETAK NOTA'!$D$1730:$D$1746,E157,'CETAK NOTA'!$B$6:$B$21:'CETAK NOTA'!$B$1730:$B$1746,B157)","v":0},null,{"$f":"SUMIFS('CETAK NOTA'!$C$6:$C$21:'CETAK NOTA'!$C$1730:$C$1746,'CETAK NOTA'!$D$6:$D$21:'CETAK NOTA'!$D$1730:$D$1746,G157,'CETAK NOTA'!$B$6:$B$21:'CETAK NOTA'!$B$1730:$B$1746,B157)","v":0}]
[null,null,"",{"$f":"SUMIFS('CETAK NOTA'!$C$6:$C$21:'CETAK NOTA'!$C$1730:$C$1746,'CETAK NOTA'!$D$6:$D$21:'CETAK NOTA'!$D$1730:$D$1746,E158,'CETAK NOTA'!$B$6:$B$21:'CETAK NOTA'!$B$1730:$B$1746,B158)","v":0},null,{"$f":"SUMIFS('CETAK NOTA'!$C$6:$C$21:'CETAK NOTA'!$C$1730:$C$1746,'CETAK NOTA'!$D$6:$D$21:'CETAK NOTA'!$D$1730:$D$1746,G158,'CETAK NOTA'!$B$6:$B$21:'CETAK NOTA'!$B$1730:$B$1746,B158)","v":0}]
[null,null,"",{"$f":"SUMIFS('CETAK NOTA'!$C$6:$C$21:'CETAK NOTA'!$C$1730:$C$1746,'CETAK NOTA'!$D$6:$D$21:'CETAK NOTA'!$D$1730:$D$1746,E159,'CETAK NOTA'!$B$6:$B$21:'CETAK NOTA'!$B$1730:$B$1746,B159)","v":0},null,{"$f":"SUMIFS('CETAK NOTA'!$C$6:$C$21:'CETAK NOTA'!$C$1730:$C$1746,'CETAK NOTA'!$D$6:$D$21:'CETAK NOTA'!$D$1730:$D$1746,G159,'CETAK NOTA'!$B$6:$B$21:'CETAK NOTA'!$B$1730:$B$1746,B159)","v":0}]
[null,null,"",{"$f":"SUMIFS('CETAK NOTA'!$C$6:$C$21:'CETAK NOTA'!$C$1730:$C$1746,'CETAK NOTA'!$D$6:$D$21:'CETAK NOTA'!$D$1730:$D$1746,E160,'CETAK NOTA'!$B$6:$B$21:'CETAK NOTA'!$B$1730:$B$1746,B160)","v":0},null,{"$f":"SUMIFS('CETAK NOTA'!$C$6:$C$21:'CETAK NOTA'!$C$1730:$C$1746,'CETAK NOTA'!$D$6:$D$21:'CETAK NOTA'!$D$1730:$D$1746,G160,'CETAK NOTA'!$B$6:$B$21:'CETAK NOTA'!$B$1730:$B$1746,B160)","v":0}]
[null,null,"",{"$f":"SUMIFS('CETAK NOTA'!$C$6:$C$21:'CETAK NOTA'!$C$1730:$C$1746,'CETAK NOTA'!$D$6:$D$21:'CETAK NOTA'!$D$1730:$D$1746,E161,'CETAK NOTA'!$B$6:$B$21:'CETAK NOTA'!$B$1730:$B$1746,B161)","v":0},null,{"$f":"SUMIFS('CETAK NOTA'!$C$6:$C$21:'CETAK NOTA'!$C$1730:$C$1746,'CETAK NOTA'!$D$6:$D$21:'CETAK NOTA'!$D$1730:$D$1746,G161,'CETAK NOTA'!$B$6:$B$21:'CETAK NOTA'!$B$1730:$B$1746,B161)","v":0}]
[null,null,"",{"$f":"SUMIFS('CETAK NOTA'!$C$6:$C$21:'CETAK NOTA'!$C$1730:$C$1746,'CETAK NOTA'!$D$6:$D$21:'CETAK NOTA'!$D$1730:$D$1746,E162,'CETAK NOTA'!$B$6:$B$21:'CETAK NOTA'!$B$1730:$B$1746,B162)","v":0},null,{"$f":"SUMIFS('CETAK NOTA'!$C$6:$C$21:'CETAK NOTA'!$C$1730:$C$1746,'CETAK NOTA'!$D$6:$D$21:'CETAK NOTA'!$D$1730:$D$1746,G162,'CETAK NOTA'!$B$6:$B$21:'CETAK NOTA'!$B$1730:$B$1746,B162)","v":0}]
[null,null,"",{"$f":"SUMIFS('CETAK NOTA'!$C$6:$C$21:'CETAK NOTA'!$C$1730:$C$1746,'CETAK NOTA'!$D$6:$D$21:'CETAK NOTA'!$D$1730:$D$1746,E163,'CETAK NOTA'!$B$6:$B$21:'CETAK NOTA'!$B$1730:$B$1746,B163)","v":0},null,{"$f":"SUMIFS('CETAK NOTA'!$C$6:$C$21:'CETAK NOTA'!$C$1730:$C$1746,'CETAK NOTA'!$D$6:$D$21:'CETAK NOTA'!$D$1730:$D$1746,G163,'CETAK NOTA'!$B$6:$B$21:'CETAK NOTA'!$B$1730:$B$1746,B163)","v":0}]
[null,null,"",{"$f":"SUMIFS('CETAK NOTA'!$C$6:$C$21:'CETAK NOTA'!$C$1730:$C$1746,'CETAK NOTA'!$D$6:$D$21:'CETAK NOTA'!$D$1730:$D$1746,E164,'CETAK NOTA'!$B$6:$B$21:'CETAK NOTA'!$B$1730:$B$1746,B164)","v":0},null,{"$f":"SUMIFS('CETAK NOTA'!$C$6:$C$21:'CETAK NOTA'!$C$1730:$C$1746,'CETAK NOTA'!$D$6:$D$21:'CETAK NOTA'!$D$1730:$D$1746,G164,'CETAK NOTA'!$B$6:$B$21:'CETAK NOTA'!$B$1730:$B$1746,B164)","v":0}]
[null,null,"",{"$f":"SUMIFS('CETAK NOTA'!$C$6:$C$21:'CETAK NOTA'!$C$1730:$C$1746,'CETAK NOTA'!$D$6:$D$21:'CETAK NOTA'!$D$1730:$D$1746,E165,'CETAK NOTA'!$B$6:$B$21:'CETAK NOTA'!$B$1730:$B$1746,B165)","v":0},null,{"$f":"SUMIFS('CETAK NOTA'!$C$6:$C$21:'CETAK NOTA'!$C$1730:$C$1746,'CETAK NOTA'!$D$6:$D$21:'CETAK NOTA'!$D$1730:$D$1746,G165,'CETAK NOTA'!$B$6:$B$21:'CETAK NOTA'!$B$1730:$B$1746,B165)","v":0}]
[null,null,"",{"$f":"SUMIFS('CETAK NOTA'!$C$6:$C$21:'CETAK NOTA'!$C$1730:$C$1746,'CETAK NOTA'!$D$6:$D$21:'CETAK NOTA'!$D$1730:$D$1746,E166,'CETAK NOTA'!$B$6:$B$21:'CETAK NOTA'!$B$1730:$B$1746,B166)","v":0},null,{"$f":"SUMIFS('CETAK NOTA'!$C$6:$C$21:'CETAK NOTA'!$C$1730:$C$1746,'CETAK NOTA'!$D$6:$D$21:'CETAK NOTA'!$D$1730:$D$1746,G166,'CETAK NOTA'!$B$6:$B$21:'CETAK NOTA'!$B$1730:$B$1746,B166)","v":0}]
[null,null,"",{"$f":"SUMIFS('CETAK NOTA'!$C$6:$C$21:'CETAK NOTA'!$C$1730:$C$1746,'CETAK NOTA'!$D$6:$D$21:'CETAK NOTA'!$D$1730:$D$1746,E167,'CETAK NOTA'!$B$6:$B$21:'CETAK NOTA'!$B$1730:$B$1746,B167)","v":0},null,{"$f":"SUMIFS('CETAK NOTA'!$C$6:$C$21:'CETAK NOTA'!$C$1730:$C$1746,'CETAK NOTA'!$D$6:$D$21:'CETAK NOTA'!$D$1730:$D$1746,G167,'CETAK NOTA'!$B$6:$B$21:'CETAK NOTA'!$B$1730:$B$1746,B167)","v":0}]
[null,null,"",{"$f":"SUMIFS('CETAK NOTA'!$C$6:$C$21:'CETAK NOTA'!$C$1730:$C$1746,'CETAK NOTA'!$D$6:$D$21:'CETAK NOTA'!$D$1730:$D$1746,E168,'CETAK NOTA'!$B$6:$B$21:'CETAK NOTA'!$B$1730:$B$1746,B168)","v":0},null,{"$f":"SUMIFS('CETAK NOTA'!$C$6:$C$21:'CETAK NOTA'!$C$1730:$C$1746,'CETAK NOTA'!$D$6:$D$21:'CETAK NOTA'!$D$1730:$D$1746,G168,'CETAK NOTA'!$B$6:$B$21:'CETAK NOTA'!$B$1730:$B$1746,B168)","v":0}]
[null,null,"",{"$f":"SUMIFS('CETAK NOTA'!$C$6:$C$21:'CETAK NOTA'!$C$1730:$C$1746,'CETAK NOTA'!$D$6:$D$21:'CETAK NOTA'!$D$1730:$D$1746,E169,'CETAK NOTA'!$B$6:$B$21:'CETAK NOTA'!$B$1730:$B$1746,B169)","v":0},null,{"$f":"SUMIFS('CETAK NOTA'!$C$6:$C$21:'CETAK NOTA'!$C$1730:$C$1746,'CETAK NOTA'!$D$6:$D$21:'CETAK NOTA'!$D$1730:$D$1746,G169,'CETAK NOTA'!$B$6:$B$21:'CETAK NOTA'!$B$1730:$B$1746,B169)","v":0}]
[null,null,"",{"$f":"SUMIFS('CETAK NOTA'!$C$6:$C$21:'CETAK NOTA'!$C$1730:$C$1746,'CETAK NOTA'!$D$6:$D$21:'CETAK NOTA'!$D$1730:$D$1746,E170,'CETAK NOTA'!$B$6:$B$21:'CETAK NOTA'!$B$1730:$B$1746,B170)","v":0},null,{"$f":"SUMIFS('CETAK NOTA'!$C$6:$C$21:'CETAK NOTA'!$C$1730:$C$1746,'CETAK NOTA'!$D$6:$D$21:'CETAK NOTA'!$D$1730:$D$1746,G170,'CETAK NOTA'!$B$6:$B$21:'CETAK NOTA'!$B$1730:$B$1746,B170)","v":0}]
[null,null,"",{"$f":"SUMIFS('CETAK NOTA'!$C$6:$C$21:'CETAK NOTA'!$C$1730:$C$1746,'CETAK NOTA'!$D$6:$D$21:'CETAK NOTA'!$D$1730:$D$1746,E171,'CETAK NOTA'!$B$6:$B$21:'CETAK NOTA'!$B$1730:$B$1746,B171)","v":0},null,{"$f":"SUMIFS('CETAK NOTA'!$C$6:$C$21:'CETAK NOTA'!$C$1730:$C$1746,'CETAK NOTA'!$D$6:$D$21:'CETAK NOTA'!$D$1730:$D$1746,G171,'CETAK NOTA'!$B$6:$B$21:'CETAK NOTA'!$B$1730:$B$1746,B171)","v":0}]
[null,null,"",{"$f":"SUMIFS('CETAK NOTA'!$C$6:$C$21:'CETAK NOTA'!$C$1730:$C$1746,'CETAK NOTA'!$D$6:$D$21:'CETAK NOTA'!$D$1730:$D$1746,E172,'CETAK NOTA'!$B$6:$B$21:'CETAK NOTA'!$B$1730:$B$1746,B172)","v":0},null,{"$f":"SUMIFS('CETAK NOTA'!$C$6:$C$21:'CETAK NOTA'!$C$1730:$C$1746,'CETAK NOTA'!$D$6:$D$21:'CETAK NOTA'!$D$1730:$D$1746,G172,'CETAK NOTA'!$B$6:$B$21:'CETAK NOTA'!$B$1730:$B$1746,B172)","v":0}]
[null,null,"",{"$f":"SUMIFS('CETAK NOTA'!$C$6:$C$21:'CETAK NOTA'!$C$1730:$C$1746,'CETAK NOTA'!$D$6:$D$21:'CETAK NOTA'!$D$1730:$D$1746,E173,'CETAK NOTA'!$B$6:$B$21:'CETAK NOTA'!$B$1730:$B$1746,B173)","v":0},null,{"$f":"SUMIFS('CETAK NOTA'!$C$6:$C$21:'CETAK NOTA'!$C$1730:$C$1746,'CETAK NOTA'!$D$6:$D$21:'CETAK NOTA'!$D$1730:$D$1746,G173,'CETAK NOTA'!$B$6:$B$21:'CETAK NOTA'!$B$1730:$B$1746,B173)","v":0}]
[null,null,"",{"$f":"SUMIFS('CETAK NOTA'!$C$6:$C$21:'CETAK NOTA'!$C$1730:$C$1746,'CETAK NOTA'!$D$6:$D$21:'CETAK NOTA'!$D$1730:$D$1746,E174,'CETAK NOTA'!$B$6:$B$21:'CETAK NOTA'!$B$1730:$B$1746,B174)","v":0},null,{"$f":"SUMIFS('CETAK NOTA'!$C$6:$C$21:'CETAK NOTA'!$C$1730:$C$1746,'CETAK NOTA'!$D$6:$D$21:'CETAK NOTA'!$D$1730:$D$1746,G174,'CETAK NOTA'!$B$6:$B$21:'CETAK NOTA'!$B$1730:$B$1746,B174)","v":0}]
[null,null,"",{"$f":"SUMIFS('CETAK NOTA'!$C$6:$C$21:'CETAK NOTA'!$C$1730:$C$1746,'CETAK NOTA'!$D$6:$D$21:'CETAK NOTA'!$D$1730:$D$1746,E175,'CETAK NOTA'!$B$6:$B$21:'CETAK NOTA'!$B$1730:$B$1746,B175)","v":0},null,{"$f":"SUMIFS('CETAK NOTA'!$C$6:$C$21:'CETAK NOTA'!$C$1730:$C$1746,'CETAK NOTA'!$D$6:$D$21:'CETAK NOTA'!$D$1730:$D$1746,G175,'CETAK NOTA'!$B$6:$B$21:'CETAK NOTA'!$B$1730:$B$1746,B175)","v":0}]
[null,null,"",{"$f":"SUMIFS('CETAK NOTA'!$C$6:$C$21:'CETAK NOTA'!$C$1730:$C$1746,'CETAK NOTA'!$D$6:$D$21:'CETAK NOTA'!$D$1730:$D$1746,E176,'CETAK NOTA'!$B$6:$B$21:'CETAK NOTA'!$B$1730:$B$1746,B176)","v":0},null,{"$f":"SUMIFS('CETAK NOTA'!$C$6:$C$21:'CETAK NOTA'!$C$1730:$C$1746,'CETAK NOTA'!$D$6:$D$21:'CETAK NOTA'!$D$1730:$D$1746,G176,'CETAK NOTA'!$B$6:$B$21:'CETAK NOTA'!$B$1730:$B$1746,B176)","v":0}]
[null,null,"",{"$f":"SUMIFS('CETAK NOTA'!$C$6:$C$21:'CETAK NOTA'!$C$1730:$C$1746,'CETAK NOTA'!$D$6:$D$21:'CETAK NOTA'!$D$1730:$D$1746,E177,'CETAK NOTA'!$B$6:$B$21:'CETAK NOTA'!$B$1730:$B$1746,B177)","v":0},null,{"$f":"SUMIFS('CETAK NOTA'!$C$6:$C$21:'CETAK NOTA'!$C$1730:$C$1746,'CETAK NOTA'!$D$6:$D$21:'CETAK NOTA'!$D$1730:$D$1746,G177,'CETAK NOTA'!$B$6:$B$21:'CETAK NOTA'!$B$1730:$B$1746,B177)","v":0}]
[null,null,"",{"$f":"SUMIFS('CETAK NOTA'!$C$6:$C$21:'CETAK NOTA'!$C$1730:$C$1746,'CETAK NOTA'!$D$6:$D$21:'CETAK NOTA'!$D$1730:$D$1746,E178,'CETAK NOTA'!$B$6:$B$21:'CETAK NOTA'!$B$1730:$B$1746,B178)","v":0},null,{"$f":"SUMIFS('CETAK NOTA'!$C$6:$C$21:'CETAK NOTA'!$C$1730:$C$1746,'CETAK NOTA'!$D$6:$D$21:'CETAK NOTA'!$D$1730:$D$1746,G178,'CETAK NOTA'!$B$6:$B$21:'CETAK NOTA'!$B$1730:$B$1746,B178)","v":0}]
[null,null,"",{"$f":"SUMIFS('CETAK NOTA'!$C$6:$C$21:'CETAK NOTA'!$C$1730:$C$1746,'CETAK NOTA'!$D$6:$D$21:'CETAK NOTA'!$D$1730:$D$1746,E179,'CETAK NOTA'!$B$6:$B$21:'CETAK NOTA'!$B$1730:$B$1746,B179)","v":0},null,{"$f":"SUMIFS('CETAK NOTA'!$C$6:$C$21:'CETAK NOTA'!$C$1730:$C$1746,'CETAK NOTA'!$D$6:$D$21:'CETAK NOTA'!$D$1730:$D$1746,G179,'CETAK NOTA'!$B$6:$B$21:'CETAK NOTA'!$B$1730:$B$1746,B179)","v":0}]
[null,null,"",{"$f":"SUMIFS('CETAK NOTA'!$C$6:$C$21:'CETAK NOTA'!$C$1730:$C$1746,'CETAK NOTA'!$D$6:$D$21:'CETAK NOTA'!$D$1730:$D$1746,E180,'CETAK NOTA'!$B$6:$B$21:'CETAK NOTA'!$B$1730:$B$1746,B180)","v":0},null,{"$f":"SUMIFS('CETAK NOTA'!$C$6:$C$21:'CETAK NOTA'!$C$1730:$C$1746,'CETAK NOTA'!$D$6:$D$21:'CETAK NOTA'!$D$1730:$D$1746,G180,'CETAK NOTA'!$B$6:$B$21:'CETAK NOTA'!$B$1730:$B$1746,B180)","v":0}]
[null,null,"",{"$f":"SUMIFS('CETAK NOTA'!$C$6:$C$21:'CETAK NOTA'!$C$1730:$C$1746,'CETAK NOTA'!$D$6:$D$21:'CETAK NOTA'!$D$1730:$D$1746,E181,'CETAK NOTA'!$B$6:$B$21:'CETAK NOTA'!$B$1730:$B$1746,B181)","v":0},null,{"$f":"SUMIFS('CETAK NOTA'!$C$6:$C$21:'CETAK NOTA'!$C$1730:$C$1746,'CETAK NOTA'!$D$6:$D$21:'CETAK NOTA'!$D$1730:$D$1746,G181,'CETAK NOTA'!$B$6:$B$21:'CETAK NOTA'!$B$1730:$B$1746,B181)","v":0}]
[null,null,"",{"$f":"SUMIFS('CETAK NOTA'!$C$6:$C$21:'CETAK NOTA'!$C$1730:$C$1746,'CETAK NOTA'!$D$6:$D$21:'CETAK NOTA'!$D$1730:$D$1746,E182,'CETAK NOTA'!$B$6:$B$21:'CETAK NOTA'!$B$1730:$B$1746,B182)","v":0},null,{"$f":"SUMIFS('CETAK NOTA'!$C$6:$C$21:'CETAK NOTA'!$C$1730:$C$1746,'CETAK NOTA'!$D$6:$D$21:'CETAK NOTA'!$D$1730:$D$1746,G182,'CETAK NOTA'!$B$6:$B$21:'CETAK NOTA'!$B$1730:$B$1746,B182)","v":0}]
[null,null,"",{"$f":"SUMIFS('CETAK NOTA'!$C$6:$C$21:'CETAK NOTA'!$C$1730:$C$1746,'CETAK NOTA'!$D$6:$D$21:'CETAK NOTA'!$D$1730:$D$1746,E183,'CETAK NOTA'!$B$6:$B$21:'CETAK NOTA'!$B$1730:$B$1746,B183)","v":0},null,{"$f":"SUMIFS('CETAK NOTA'!$C$6:$C$21:'CETAK NOTA'!$C$1730:$C$1746,'CETAK NOTA'!$D$6:$D$21:'CETAK NOTA'!$D$1730:$D$1746,G183,'CETAK NOTA'!$B$6:$B$21:'CETAK NOTA'!$B$1730:$B$1746,B183)","v":0}]
[null,null,"",{"$f":"SUMIFS('CETAK NOTA'!$C$6:$C$21:'CETAK NOTA'!$C$1730:$C$1746,'CETAK NOTA'!$D$6:$D$21:'CETAK NOTA'!$D$1730:$D$1746,E184,'CETAK NOTA'!$B$6:$B$21:'CETAK NOTA'!$B$1730:$B$1746,B184)","v":0},null,{"$f":"SUMIFS('CETAK NOTA'!$C$6:$C$21:'CETAK NOTA'!$C$1730:$C$1746,'CETAK NOTA'!$D$6:$D$21:'CETAK NOTA'!$D$1730:$D$1746,G184,'CETAK NOTA'!$B$6:$B$21:'CETAK NOTA'!$B$1730:$B$1746,B184)","v":0}]
[null,null,"",{"$f":"SUMIFS('CETAK NOTA'!$C$6:$C$21:'CETAK NOTA'!$C$1730:$C$1746,'CETAK NOTA'!$D$6:$D$21:'CETAK NOTA'!$D$1730:$D$1746,E185,'CETAK NOTA'!$B$6:$B$21:'CETAK NOTA'!$B$1730:$B$1746,B185)","v":0},null,{"$f":"SUMIFS('CETAK NOTA'!$C$6:$C$21:'CETAK NOTA'!$C$1730:$C$1746,'CETAK NOTA'!$D$6:$D$21:'CETAK NOTA'!$D$1730:$D$1746,G185,'CETAK NOTA'!$B$6:$B$21:'CETAK NOTA'!$B$1730:$B$1746,B185)","v":0}]
[null,null,"",{"$f":"SUMIFS('CETAK NOTA'!$C$6:$C$21:'CETAK NOTA'!$C$1730:$C$1746,'CETAK NOTA'!$D$6:$D$21:'CETAK NOTA'!$D$1730:$D$1746,E186,'CETAK NOTA'!$B$6:$B$21:'CETAK NOTA'!$B$1730:$B$1746,B186)","v":0},null,{"$f":"SUMIFS('CETAK NOTA'!$C$6:$C$21:'CETAK NOTA'!$C$1730:$C$1746,'CETAK NOTA'!$D$6:$D$21:'CETAK NOTA'!$D$1730:$D$1746,G186,'CETAK NOTA'!$B$6:$B$21:'CETAK NOTA'!$B$1730:$B$1746,B186)","v":0}]
[null,null,"",{"$f":"SUMIFS('CETAK NOTA'!$C$6:$C$21:'CETAK NOTA'!$C$1730:$C$1746,'CETAK NOTA'!$D$6:$D$21:'CETAK NOTA'!$D$1730:$D$1746,E187,'CETAK NOTA'!$B$6:$B$21:'CETAK NOTA'!$B$1730:$B$1746,B187)","v":0},null,{"$f":"SUMIFS('CETAK NOTA'!$C$6:$C$21:'CETAK NOTA'!$C$1730:$C$1746,'CETAK NOTA'!$D$6:$D$21:'CETAK NOTA'!$D$1730:$D$1746,G187,'CETAK NOTA'!$B$6:$B$21:'CETAK NOTA'!$B$1730:$B$1746,B187)","v":0}]
[null,null,"",{"$f":"SUMIFS('CETAK NOTA'!$C$6:$C$21:'CETAK NOTA'!$C$1730:$C$1746,'CETAK NOTA'!$D$6:$D$21:'CETAK NOTA'!$D$1730:$D$1746,E188,'CETAK NOTA'!$B$6:$B$21:'CETAK NOTA'!$B$1730:$B$1746,B188)","v":0},null,{"$f":"SUMIFS('CETAK NOTA'!$C$6:$C$21:'CETAK NOTA'!$C$1730:$C$1746,'CETAK NOTA'!$D$6:$D$21:'CETAK NOTA'!$D$1730:$D$1746,G188,'CETAK NOTA'!$B$6:$B$21:'CETAK NOTA'!$B$1730:$B$1746,B188)","v":0}]
[null,null,"",{"$f":"SUMIFS('CETAK NOTA'!$C$6:$C$21:'CETAK NOTA'!$C$1730:$C$1746,'CETAK NOTA'!$D$6:$D$21:'CETAK NOTA'!$D$1730:$D$1746,E189,'CETAK NOTA'!$B$6:$B$21:'CETAK NOTA'!$B$1730:$B$1746,B189)","v":0},null,{"$f":"SUMIFS('CETAK NOTA'!$C$6:$C$21:'CETAK NOTA'!$C$1730:$C$1746,'CETAK NOTA'!$D$6:$D$21:'CETAK NOTA'!$D$1730:$D$1746,G189,'CETAK NOTA'!$B$6:$B$21:'CETAK NOTA'!$B$1730:$B$1746,B189)","v":0}]
[null,null,"",{"$f":"SUMIFS('CETAK NOTA'!$C$6:$C$21:'CETAK NOTA'!$C$1730:$C$1746,'CETAK NOTA'!$D$6:$D$21:'CETAK NOTA'!$D$1730:$D$1746,E190,'CETAK NOTA'!$B$6:$B$21:'CETAK NOTA'!$B$1730:$B$1746,B190)","v":0},null,{"$f":"SUMIFS('CETAK NOTA'!$C$6:$C$21:'CETAK NOTA'!$C$1730:$C$1746,'CETAK NOTA'!$D$6:$D$21:'CETAK NOTA'!$D$1730:$D$1746,G190,'CETAK NOTA'!$B$6:$B$21:'CETAK NOTA'!$B$1730:$B$1746,B190)","v":0}]
[null,null,"",{"$f":"SUMIFS('CETAK NOTA'!$C$6:$C$21:'CETAK NOTA'!$C$1730:$C$1746,'CETAK NOTA'!$D$6:$D$21:'CETAK NOTA'!$D$1730:$D$1746,E191,'CETAK NOTA'!$B$6:$B$21:'CETAK NOTA'!$B$1730:$B$1746,B191)","v":0},null,{"$f":"SUMIFS('CETAK NOTA'!$C$6:$C$21:'CETAK NOTA'!$C$1730:$C$1746,'CETAK NOTA'!$D$6:$D$21:'CETAK NOTA'!$D$1730:$D$1746,G191,'CETAK NOTA'!$B$6:$B$21:'CETAK NOTA'!$B$1730:$B$1746,B191)","v":0}]
[null,null,"",{"$f":"SUMIFS('CETAK NOTA'!$C$6:$C$21:'CETAK NOTA'!$C$1730:$C$1746,'CETAK NOTA'!$D$6:$D$21:'CETAK NOTA'!$D$1730:$D$1746,E192,'CETAK NOTA'!$B$6:$B$21:'CETAK NOTA'!$B$1730:$B$1746,B192)","v":0},null,{"$f":"SUMIFS('CETAK NOTA'!$C$6:$C$21:'CETAK NOTA'!$C$1730:$C$1746,'CETAK NOTA'!$D$6:$D$21:'CETAK NOTA'!$D$1730:$D$1746,G192,'CETAK NOTA'!$B$6:$B$21:'CETAK NOTA'!$B$1730:$B$1746,B192)","v":0}]
[null,null,"",{"$f":"SUMIFS('CETAK NOTA'!$C$6:$C$21:'CETAK NOTA'!$C$1730:$C$1746,'CETAK NOTA'!$D$6:$D$21:'CETAK NOTA'!$D$1730:$D$1746,E193,'CETAK NOTA'!$B$6:$B$21:'CETAK NOTA'!$B$1730:$B$1746,B193)","v":0},null,{"$f":"SUMIFS('CETAK NOTA'!$C$6:$C$21:'CETAK NOTA'!$C$1730:$C$1746,'CETAK NOTA'!$D$6:$D$21:'CETAK NOTA'!$D$1730:$D$1746,G193,'CETAK NOTA'!$B$6:$B$21:'CETAK NOTA'!$B$1730:$B$1746,B193)","v":0}]
[null,null,{"$f":"IF(AND(K194=0,L194=0),\"\",IF(AND(D194>0,K194>L194),\"RM\",\"TK\"))","v":""},{"$f":"SUMIFS('CETAK NOTA'!$C$6:$C$21:'CETAK NOTA'!$C$1730:$C$1746,'CETAK NOTA'!$D$6:$D$21:'CETAK NOTA'!$D$1730:$D$1746,E194,'CETAK NOTA'!$B$6:$B$21:'CETAK NOTA'!$B$1730:$B$1746,B194)","v":0},null,{"$f":"SUMIFS('CETAK NOTA'!$C$6:$C$21:'CETAK NOTA'!$C$1730:$C$1746,'CETAK NOTA'!$D$6:$D$21:'CETAK NOTA'!$D$1730:$D$1746,G194,'CETAK NOTA'!$B$6:$B$21:'CETAK NOTA'!$B$1730:$B$1746,B194)","v":0}]
[null,null,"",{"$f":"SUMIFS('CETAK NOTA'!$C$6:$C$21:'CETAK NOTA'!$C$1730:$C$1746,'CETAK NOTA'!$D$6:$D$21:'CETAK NOTA'!$D$1730:$D$1746,E195,'CETAK NOTA'!$B$6:$B$21:'CETAK NOTA'!$B$1730:$B$1746,B195)","v":0},null,{"$f":"SUMIFS('CETAK NOTA'!$C$6:$C$21:'CETAK NOTA'!$C$1730:$C$1746,'CETAK NOTA'!$D$6:$D$21:'CETAK NOTA'!$D$1730:$D$1746,G195,'CETAK NOTA'!$B$6:$B$21:'CETAK NOTA'!$B$1730:$B$1746,B195)","v":0}]
[null,null,"",{"$f":"SUMIFS('CETAK NOTA'!$C$6:$C$21:'CETAK NOTA'!$C$1730:$C$1746,'CETAK NOTA'!$D$6:$D$21:'CETAK NOTA'!$D$1730:$D$1746,E196,'CETAK NOTA'!$B$6:$B$21:'CETAK NOTA'!$B$1730:$B$1746,B196)","v":0},null,{"$f":"SUMIFS('CETAK NOTA'!$C$6:$C$21:'CETAK NOTA'!$C$1730:$C$1746,'CETAK NOTA'!$D$6:$D$21:'CETAK NOTA'!$D$1730:$D$1746,G196,'CETAK NOTA'!$B$6:$B$21:'CETAK NOTA'!$B$1730:$B$1746,B196)","v":0}]
[null,null,"",{"$f":"SUMIFS('CETAK NOTA'!$C$6:$C$21:'CETAK NOTA'!$C$1730:$C$1746,'CETAK NOTA'!$D$6:$D$21:'CETAK NOTA'!$D$1730:$D$1746,E197,'CETAK NOTA'!$B$6:$B$21:'CETAK NOTA'!$B$1730:$B$1746,B197)","v":0},null,{"$f":"SUMIFS('CETAK NOTA'!$C$6:$C$21:'CETAK NOTA'!$C$1730:$C$1746,'CETAK NOTA'!$D$6:$D$21:'CETAK NOTA'!$D$1730:$D$1746,G197,'CETAK NOTA'!$B$6:$B$21:'CETAK NOTA'!$B$1730:$B$1746,B197)","v":0}]
[null,null,"",{"$f":"SUMIFS('CETAK NOTA'!$C$6:$C$21:'CETAK NOTA'!$C$1730:$C$1746,'CETAK NOTA'!$D$6:$D$21:'CETAK NOTA'!$D$1730:$D$1746,E198,'CETAK NOTA'!$B$6:$B$21:'CETAK NOTA'!$B$1730:$B$1746,B198)","v":0},null,{"$f":"SUMIFS('CETAK NOTA'!$C$6:$C$21:'CETAK NOTA'!$C$1730:$C$1746,'CETAK NOTA'!$D$6:$D$21:'CETAK NOTA'!$D$1730:$D$1746,G198,'CETAK NOTA'!$B$6:$B$21:'CETAK NOTA'!$B$1730:$B$1746,B198)","v":0}]
[null,null,"",{"$f":"SUMIFS('CETAK NOTA'!$C$6:$C$21:'CETAK NOTA'!$C$1730:$C$1746,'CETAK NOTA'!$D$6:$D$21:'CETAK NOTA'!$D$1730:$D$1746,E199,'CETAK NOTA'!$B$6:$B$21:'CETAK NOTA'!$B$1730:$B$1746,B199)","v":0},null,{"$f":"SUMIFS('CETAK NOTA'!$C$6:$C$21:'CETAK NOTA'!$C$1730:$C$1746,'CETAK NOTA'!$D$6:$D$21:'CETAK NOTA'!$D$1730:$D$1746,G199,'CETAK NOTA'!$B$6:$B$21:'CETAK NOTA'!$B$1730:$B$1746,B199)","v":0}]
[null,null,"",{"$f":"SUMIFS('CETAK NOTA'!$C$6:$C$21:'CETAK NOTA'!$C$1730:$C$1746,'CETAK NOTA'!$D$6:$D$21:'CETAK NOTA'!$D$1730:$D$1746,E200,'CETAK NOTA'!$B$6:$B$21:'CETAK NOTA'!$B$1730:$B$1746,B200)","v":0},null,{"$f":"SUMIFS('CETAK NOTA'!$C$6:$C$21:'CETAK NOTA'!$C$1730:$C$1746,'CETAK NOTA'!$D$6:$D$21:'CETAK NOTA'!$D$1730:$D$1746,G200,'CETAK NOTA'!$B$6:$B$21:'CETAK NOTA'!$B$1730:$B$1746,B200)","v":0}]
[null,null,"",{"$f":"SUMIFS('CETAK NOTA'!$C$6:$C$21:'CETAK NOTA'!$C$1730:$C$1746,'CETAK NOTA'!$D$6:$D$21:'CETAK NOTA'!$D$1730:$D$1746,E201,'CETAK NOTA'!$B$6:$B$21:'CETAK NOTA'!$B$1730:$B$1746,B201)","v":0},null,{"$f":"SUMIFS('CETAK NOTA'!$C$6:$C$21:'CETAK NOTA'!$C$1730:$C$1746,'CETAK NOTA'!$D$6:$D$21:'CETAK NOTA'!$D$1730:$D$1746,G201,'CETAK NOTA'!$B$6:$B$21:'CETAK NOTA'!$B$1730:$B$1746,B201)","v":0}]
[null,null,"",{"$f":"SUMIFS('CETAK NOTA'!$C$6:$C$21:'CETAK NOTA'!$C$1730:$C$1746,'CETAK NOTA'!$D$6:$D$21:'CETAK NOTA'!$D$1730:$D$1746,E202,'CETAK NOTA'!$B$6:$B$21:'CETAK NOTA'!$B$1730:$B$1746,B202)","v":0},null,{"$f":"SUMIFS('CETAK NOTA'!$C$6:$C$21:'CETAK NOTA'!$C$1730:$C$1746,'CETAK NOTA'!$D$6:$D$21:'CETAK NOTA'!$D$1730:$D$1746,G202,'CETAK NOTA'!$B$6:$B$21:'CETAK NOTA'!$B$1730:$B$1746,B202)","v":0}]
[null,null,"",{"$f":"SUMIFS('CETAK NOTA'!$C$6:$C$21:'CETAK NOTA'!$C$1730:$C$1746,'CETAK NOTA'!$D$6:$D$21:'CETAK NOTA'!$D$1730:$D$1746,E203,'CETAK NOTA'!$B$6:$B$21:'CETAK NOTA'!$B$1730:$B$1746,B203)","v":0},null,{"$f":"SUMIFS('CETAK NOTA'!$C$6:$C$21:'CETAK NOTA'!$C$1730:$C$1746,'CETAK NOTA'!$D$6:$D$21:'CETAK NOTA'!$D$1730:$D$1746,G203,'CETAK NOTA'!$B$6:$B$21:'CETAK NOTA'!$B$1730:$B$1746,B203)","v":0}]
[null,null,"",{"$f":"SUMIFS('CETAK NOTA'!$C$6:$C$21:'CETAK NOTA'!$C$1730:$C$1746,'CETAK NOTA'!$D$6:$D$21:'CETAK NOTA'!$D$1730:$D$1746,E204,'CETAK NOTA'!$B$6:$B$21:'CETAK NOTA'!$B$1730:$B$1746,B204)","v":0},null,{"$f":"SUMIFS('CETAK NOTA'!$C$6:$C$21:'CETAK NOTA'!$C$1730:$C$1746,'CETAK NOTA'!$D$6:$D$21:'CETAK NOTA'!$D$1730:$D$1746,G204,'CETAK NOTA'!$B$6:$B$21:'CETAK NOTA'!$B$1730:$B$1746,B204)","v":0}]
[null,null,"",{"$f":"SUMIFS('CETAK NOTA'!$C$6:$C$21:'CETAK NOTA'!$C$1730:$C$1746,'CETAK NOTA'!$D$6:$D$21:'CETAK NOTA'!$D$1730:$D$1746,E205,'CETAK NOTA'!$B$6:$B$21:'CETAK NOTA'!$B$1730:$B$1746,B205)","v":0},null,{"$f":"SUMIFS('CETAK NOTA'!$C$6:$C$21:'CETAK NOTA'!$C$1730:$C$1746,'CETAK NOTA'!$D$6:$D$21:'CETAK NOTA'!$D$1730:$D$1746,G205,'CETAK NOTA'!$B$6:$B$21:'CETAK NOTA'!$B$1730:$B$1746,B205)","v":0}]
[null,null,"",{"$f":"SUMIFS('CETAK NOTA'!$C$6:$C$21:'CETAK NOTA'!$C$1730:$C$1746,'CETAK NOTA'!$D$6:$D$21:'CETAK NOTA'!$D$1730:$D$1746,E206,'CETAK NOTA'!$B$6:$B$21:'CETAK NOTA'!$B$1730:$B$1746,B206)","v":0},null,{"$f":"SUMIFS('CETAK NOTA'!$C$6:$C$21:'CETAK NOTA'!$C$1730:$C$1746,'CETAK NOTA'!$D$6:$D$21:'CETAK NOTA'!$D$1730:$D$1746,G206,'CETAK NOTA'!$B$6:$B$21:'CETAK NOTA'!$B$1730:$B$1746,B206)","v":0}]
[null,null,"",{"$f":"SUMIFS('CETAK NOTA'!$C$6:$C$21:'CETAK NOTA'!$C$1730:$C$1746,'CETAK NOTA'!$D$6:$D$21:'CETAK NOTA'!$D$1730:$D$1746,E207,'CETAK NOTA'!$B$6:$B$21:'CETAK NOTA'!$B$1730:$B$1746,B207)","v":0},null,{"$f":"SUMIFS('CETAK NOTA'!$C$6:$C$21:'CETAK NOTA'!$C$1730:$C$1746,'CETAK NOTA'!$D$6:$D$21:'CETAK NOTA'!$D$1730:$D$1746,G207,'CETAK NOTA'!$B$6:$B$21:'CETAK NOTA'!$B$1730:$B$1746,B207)","v":0}]
[null,null,"",{"$f":"SUMIFS('CETAK NOTA'!$C$6:$C$21:'CETAK NOTA'!$C$1730:$C$1746,'CETAK NOTA'!$D$6:$D$21:'CETAK NOTA'!$D$1730:$D$1746,E208,'CETAK NOTA'!$B$6:$B$21:'CETAK NOTA'!$B$1730:$B$1746,B208)","v":0},null,{"$f":"SUMIFS('CETAK NOTA'!$C$6:$C$21:'CETAK NOTA'!$C$1730:$C$1746,'CETAK NOTA'!$D$6:$D$21:'CETAK NOTA'!$D$1730:$D$1746,G208,'CETAK NOTA'!$B$6:$B$21:'CETAK NOTA'!$B$1730:$B$1746,B208)","v":0}]
[null,null,"",{"$f":"SUMIFS('CETAK NOTA'!$C$6:$C$21:'CETAK NOTA'!$C$1730:$C$1746,'CETAK NOTA'!$D$6:$D$21:'CETAK NOTA'!$D$1730:$D$1746,E209,'CETAK NOTA'!$B$6:$B$21:'CETAK NOTA'!$B$1730:$B$1746,B209)","v":0},null,{"$f":"SUMIFS('CETAK NOTA'!$C$6:$C$21:'CETAK NOTA'!$C$1730:$C$1746,'CETAK NOTA'!$D$6:$D$21:'CETAK NOTA'!$D$1730:$D$1746,G209,'CETAK NOTA'!$B$6:$B$21:'CETAK NOTA'!$B$1730:$B$1746,B209)","v":0}]
[null,null,"",{"$f":"SUMIFS('CETAK NOTA'!$C$6:$C$21:'CETAK NOTA'!$C$1730:$C$1746,'CETAK NOTA'!$D$6:$D$21:'CETAK NOTA'!$D$1730:$D$1746,E210,'CETAK NOTA'!$B$6:$B$21:'CETAK NOTA'!$B$1730:$B$1746,B210)","v":0},null,{"$f":"SUMIFS('CETAK NOTA'!$C$6:$C$21:'CETAK NOTA'!$C$1730:$C$1746,'CETAK NOTA'!$D$6:$D$21:'CETAK NOTA'!$D$1730:$D$1746,G210,'CETAK NOTA'!$B$6:$B$21:'CETAK NOTA'!$B$1730:$B$1746,B210)","v":0}]
[null,null,"",{"$f":"SUMIFS('CETAK NOTA'!$C$6:$C$21:'CETAK NOTA'!$C$1730:$C$1746,'CETAK NOTA'!$D$6:$D$21:'CETAK NOTA'!$D$1730:$D$1746,E211,'CETAK NOTA'!$B$6:$B$21:'CETAK NOTA'!$B$1730:$B$1746,B211)","v":0},null,{"$f":"SUMIFS('CETAK NOTA'!$C$6:$C$21:'CETAK NOTA'!$C$1730:$C$1746,'CETAK NOTA'!$D$6:$D$21:'CETAK NOTA'!$D$1730:$D$1746,G211,'CETAK NOTA'!$B$6:$B$21:'CETAK NOTA'!$B$1730:$B$1746,B211)","v":0}]
[null,null,"",{"$f":"SUMIFS('CETAK NOTA'!$C$6:$C$21:'CETAK NOTA'!$C$1730:$C$1746,'CETAK NOTA'!$D$6:$D$21:'CETAK NOTA'!$D$1730:$D$1746,E212,'CETAK NOTA'!$B$6:$B$21:'CETAK NOTA'!$B$1730:$B$1746,B212)","v":0},null,{"$f":"SUMIFS('CETAK NOTA'!$C$6:$C$21:'CETAK NOTA'!$C$1730:$C$1746,'CETAK NOTA'!$D$6:$D$21:'CETAK NOTA'!$D$1730:$D$1746,G212,'CETAK NOTA'!$B$6:$B$21:'CETAK NOTA'!$B$1730:$B$1746,B212)","v":0}]
[null,null,"",{"$f":"SUMIFS('CETAK NOTA'!$C$6:$C$21:'CETAK NOTA'!$C$1730:$C$1746,'CETAK NOTA'!$D$6:$D$21:'CETAK NOTA'!$D$1730:$D$1746,E213,'CETAK NOTA'!$B$6:$B$21:'CETAK NOTA'!$B$1730:$B$1746,B213)","v":0},null,{"$f":"SUMIFS('CETAK NOTA'!$C$6:$C$21:'CETAK NOTA'!$C$1730:$C$1746,'CETAK NOTA'!$D$6:$D$21:'CETAK NOTA'!$D$1730:$D$1746,G213,'CETAK NOTA'!$B$6:$B$21:'CETAK NOTA'!$B$1730:$B$1746,B213)","v":0}]
[null,null,"",{"$f":"SUMIFS('CETAK NOTA'!$C$6:$C$21:'CETAK NOTA'!$C$1730:$C$1746,'CETAK NOTA'!$D$6:$D$21:'CETAK NOTA'!$D$1730:$D$1746,E214,'CETAK NOTA'!$B$6:$B$21:'CETAK NOTA'!$B$1730:$B$1746,B214)","v":0},null,{"$f":"SUMIFS('CETAK NOTA'!$C$6:$C$21:'CETAK NOTA'!$C$1730:$C$1746,'CETAK NOTA'!$D$6:$D$21:'CETAK NOTA'!$D$1730:$D$1746,G214,'CETAK NOTA'!$B$6:$B$21:'CETAK NOTA'!$B$1730:$B$1746,B214)","v":0}]
[null,null,"",{"$f":"SUMIFS('CETAK NOTA'!$C$6:$C$21:'CETAK NOTA'!$C$1730:$C$1746,'CETAK NOTA'!$D$6:$D$21:'CETAK NOTA'!$D$1730:$D$1746,E215,'CETAK NOTA'!$B$6:$B$21:'CETAK NOTA'!$B$1730:$B$1746,B215)","v":0},null,{"$f":"SUMIFS('CETAK NOTA'!$C$6:$C$21:'CETAK NOTA'!$C$1730:$C$1746,'CETAK NOTA'!$D$6:$D$21:'CETAK NOTA'!$D$1730:$D$1746,G215,'CETAK NOTA'!$B$6:$B$21:'CETAK NOTA'!$B$1730:$B$1746,B215)","v":0}]
[null,null,"",{"$f":"SUMIFS('CETAK NOTA'!$C$6:$C$21:'CETAK NOTA'!$C$1730:$C$1746,'CETAK NOTA'!$D$6:$D$21:'CETAK NOTA'!$D$1730:$D$1746,E216,'CETAK NOTA'!$B$6:$B$21:'CETAK NOTA'!$B$1730:$B$1746,B216)","v":0},null,{"$f":"SUMIFS('CETAK NOTA'!$C$6:$C$21:'CETAK NOTA'!$C$1730:$C$1746,'CETAK NOTA'!$D$6:$D$21:'CETAK NOTA'!$D$1730:$D$1746,G216,'CETAK NOTA'!$B$6:$B$21:'CETAK NOTA'!$B$1730:$B$1746,B216)","v":0}]
[null,null,"",{"$f":"SUMIFS('CETAK NOTA'!$C$6:$C$21:'CETAK NOTA'!$C$1730:$C$1746,'CETAK NOTA'!$D$6:$D$21:'CETAK NOTA'!$D$1730:$D$1746,E217,'CETAK NOTA'!$B$6:$B$21:'CETAK NOTA'!$B$1730:$B$1746,B217)","v":0},null,{"$f":"SUMIFS('CETAK NOTA'!$C$6:$C$21:'CETAK NOTA'!$C$1730:$C$1746,'CETAK NOTA'!$D$6:$D$21:'CETAK NOTA'!$D$1730:$D$1746,G217,'CETAK NOTA'!$B$6:$B$21:'CETAK NOTA'!$B$1730:$B$1746,B217)","v":0}]
[null,null,"",{"$f":"SUMIFS('CETAK NOTA'!$C$6:$C$21:'CETAK NOTA'!$C$1730:$C$1746,'CETAK NOTA'!$D$6:$D$21:'CETAK NOTA'!$D$1730:$D$1746,E218,'CETAK NOTA'!$B$6:$B$21:'CETAK NOTA'!$B$1730:$B$1746,B218)","v":0},null,{"$f":"SUMIFS('CETAK NOTA'!$C$6:$C$21:'CETAK NOTA'!$C$1730:$C$1746,'CETAK NOTA'!$D$6:$D$21:'CETAK NOTA'!$D$1730:$D$1746,G218,'CETAK NOTA'!$B$6:$B$21:'CETAK NOTA'!$B$1730:$B$1746,B218)","v":0}]
[null,null,"",{"$f":"SUMIFS('CETAK NOTA'!$C$6:$C$21:'CETAK NOTA'!$C$1730:$C$1746,'CETAK NOTA'!$D$6:$D$21:'CETAK NOTA'!$D$1730:$D$1746,E219,'CETAK NOTA'!$B$6:$B$21:'CETAK NOTA'!$B$1730:$B$1746,B219)","v":0},null,{"$f":"SUMIFS('CETAK NOTA'!$C$6:$C$21:'CETAK NOTA'!$C$1730:$C$1746,'CETAK NOTA'!$D$6:$D$21:'CETAK NOTA'!$D$1730:$D$1746,G219,'CETAK NOTA'!$B$6:$B$21:'CETAK NOTA'!$B$1730:$B$1746,B219)","v":0}]
[null,null,"",{"$f":"SUMIFS('CETAK NOTA'!$C$6:$C$21:'CETAK NOTA'!$C$1730:$C$1746,'CETAK NOTA'!$D$6:$D$21:'CETAK NOTA'!$D$1730:$D$1746,E220,'CETAK NOTA'!$B$6:$B$21:'CETAK NOTA'!$B$1730:$B$1746,B220)","v":0},null,{"$f":"SUMIFS('CETAK NOTA'!$C$6:$C$21:'CETAK NOTA'!$C$1730:$C$1746,'CETAK NOTA'!$D$6:$D$21:'CETAK NOTA'!$D$1730:$D$1746,G220,'CETAK NOTA'!$B$6:$B$21:'CETAK NOTA'!$B$1730:$B$1746,B220)","v":0}]
[null,null,"",{"$f":"SUMIFS('CETAK NOTA'!$C$6:$C$21:'CETAK NOTA'!$C$1730:$C$1746,'CETAK NOTA'!$D$6:$D$21:'CETAK NOTA'!$D$1730:$D$1746,E221,'CETAK NOTA'!$B$6:$B$21:'CETAK NOTA'!$B$1730:$B$1746,B221)","v":0},null,{"$f":"SUMIFS('CETAK NOTA'!$C$6:$C$21:'CETAK NOTA'!$C$1730:$C$1746,'CETAK NOTA'!$D$6:$D$21:'CETAK NOTA'!$D$1730:$D$1746,G221,'CETAK NOTA'!$B$6:$B$21:'CETAK NOTA'!$B$1730:$B$1746,B221)","v":0}]
[null,null,"",{"$f":"SUMIFS('CETAK NOTA'!$C$6:$C$21:'CETAK NOTA'!$C$1730:$C$1746,'CETAK NOTA'!$D$6:$D$21:'CETAK NOTA'!$D$1730:$D$1746,E222,'CETAK NOTA'!$B$6:$B$21:'CETAK NOTA'!$B$1730:$B$1746,B222)","v":0},null,{"$f":"SUMIFS('CETAK NOTA'!$C$6:$C$21:'CETAK NOTA'!$C$1730:$C$1746,'CETAK NOTA'!$D$6:$D$21:'CETAK NOTA'!$D$1730:$D$1746,G222,'CETAK NOTA'!$B$6:$B$21:'CETAK NOTA'!$B$1730:$B$1746,B222)","v":0}]
[null,null,"",{"$f":"SUMIFS('CETAK NOTA'!$C$6:$C$21:'CETAK NOTA'!$C$1730:$C$1746,'CETAK NOTA'!$D$6:$D$21:'CETAK NOTA'!$D$1730:$D$1746,E223,'CETAK NOTA'!$B$6:$B$21:'CETAK NOTA'!$B$1730:$B$1746,B223)","v":0},null,{"$f":"SUMIFS('CETAK NOTA'!$C$6:$C$21:'CETAK NOTA'!$C$1730:$C$1746,'CETAK NOTA'!$D$6:$D$21:'CETAK NOTA'!$D$1730:$D$1746,G223,'CETAK NOTA'!$B$6:$B$21:'CETAK NOTA'!$B$1730:$B$1746,B223)","v":0}]
[null,null,"",{"$f":"SUMIFS('CETAK NOTA'!$C$6:$C$21:'CETAK NOTA'!$C$1730:$C$1746,'CETAK NOTA'!$D$6:$D$21:'CETAK NOTA'!$D$1730:$D$1746,E224,'CETAK NOTA'!$B$6:$B$21:'CETAK NOTA'!$B$1730:$B$1746,B224)","v":0},null,{"$f":"SUMIFS('CETAK NOTA'!$C$6:$C$21:'CETAK NOTA'!$C$1730:$C$1746,'CETAK NOTA'!$D$6:$D$21:'CETAK NOTA'!$D$1730:$D$1746,G224,'CETAK NOTA'!$B$6:$B$21:'CETAK NOTA'!$B$1730:$B$1746,B224)","v":0}]
[null,null,"",{"$f":"SUMIFS('CETAK NOTA'!$C$6:$C$21:'CETAK NOTA'!$C$1730:$C$1746,'CETAK NOTA'!$D$6:$D$21:'CETAK NOTA'!$D$1730:$D$1746,E225,'CETAK NOTA'!$B$6:$B$21:'CETAK NOTA'!$B$1730:$B$1746,B225)","v":0},null,{"$f":"SUMIFS('CETAK NOTA'!$C$6:$C$21:'CETAK NOTA'!$C$1730:$C$1746,'CETAK NOTA'!$D$6:$D$21:'CETAK NOTA'!$D$1730:$D$1746,G225,'CETAK NOTA'!$B$6:$B$21:'CETAK NOTA'!$B$1730:$B$1746,B225)","v":0}]
[null,null,"",{"$f":"SUMIFS('CETAK NOTA'!$C$6:$C$21:'CETAK NOTA'!$C$1730:$C$1746,'CETAK NOTA'!$D$6:$D$21:'CETAK NOTA'!$D$1730:$D$1746,E226,'CETAK NOTA'!$B$6:$B$21:'CETAK NOTA'!$B$1730:$B$1746,B226)","v":0},null,{"$f":"SUMIFS('CETAK NOTA'!$C$6:$C$21:'CETAK NOTA'!$C$1730:$C$1746,'CETAK NOTA'!$D$6:$D$21:'CETAK NOTA'!$D$1730:$D$1746,G226,'CETAK NOTA'!$B$6:$B$21:'CETAK NOTA'!$B$1730:$B$1746,B226)","v":0}]
[null,null,"",{"$f":"SUMIFS('CETAK NOTA'!$C$6:$C$21:'CETAK NOTA'!$C$1730:$C$1746,'CETAK NOTA'!$D$6:$D$21:'CETAK NOTA'!$D$1730:$D$1746,E227,'CETAK NOTA'!$B$6:$B$21:'CETAK NOTA'!$B$1730:$B$1746,B227)","v":0},null,{"$f":"SUMIFS('CETAK NOTA'!$C$6:$C$21:'CETAK NOTA'!$C$1730:$C$1746,'CETAK NOTA'!$D$6:$D$21:'CETAK NOTA'!$D$1730:$D$1746,G227,'CETAK NOTA'!$B$6:$B$21:'CETAK NOTA'!$B$1730:$B$1746,B227)","v":0}]
[null,null,"",{"$f":"SUMIFS('CETAK NOTA'!$C$6:$C$21:'CETAK NOTA'!$C$1730:$C$1746,'CETAK NOTA'!$D$6:$D$21:'CETAK NOTA'!$D$1730:$D$1746,E228,'CETAK NOTA'!$B$6:$B$21:'CETAK NOTA'!$B$1730:$B$1746,B228)","v":0},null,{"$f":"SUMIFS('CETAK NOTA'!$C$6:$C$21:'CETAK NOTA'!$C$1730:$C$1746,'CETAK NOTA'!$D$6:$D$21:'CETAK NOTA'!$D$1730:$D$1746,G228,'CETAK NOTA'!$B$6:$B$21:'CETAK NOTA'!$B$1730:$B$1746,B228)","v":0}]
[null,null,"",{"$f":"SUMIFS('CETAK NOTA'!$C$6:$C$21:'CETAK NOTA'!$C$1730:$C$1746,'CETAK NOTA'!$D$6:$D$21:'CETAK NOTA'!$D$1730:$D$1746,E229,'CETAK NOTA'!$B$6:$B$21:'CETAK NOTA'!$B$1730:$B$1746,B229)","v":0},null,{"$f":"SUMIFS('CETAK NOTA'!$C$6:$C$21:'CETAK NOTA'!$C$1730:$C$1746,'CETAK NOTA'!$D$6:$D$21:'CETAK NOTA'!$D$1730:$D$1746,G229,'CETAK NOTA'!$B$6:$B$21:'CETAK NOTA'!$B$1730:$B$1746,B229)","v":0}]
[null,null,"",{"$f":"SUMIFS('CETAK NOTA'!$C$6:$C$21:'CETAK NOTA'!$C$1730:$C$1746,'CETAK NOTA'!$D$6:$D$21:'CETAK NOTA'!$D$1730:$D$1746,E230,'CETAK NOTA'!$B$6:$B$21:'CETAK NOTA'!$B$1730:$B$1746,B230)","v":0},null,{"$f":"SUMIFS('CETAK NOTA'!$C$6:$C$21:'CETAK NOTA'!$C$1730:$C$1746,'CETAK NOTA'!$D$6:$D$21:'CETAK NOTA'!$D$1730:$D$1746,G230,'CETAK NOTA'!$B$6:$B$21:'CETAK NOTA'!$B$1730:$B$1746,B230)","v":0}]
[null,null,"",{"$f":"SUMIFS('CETAK NOTA'!$C$6:$C$21:'CETAK NOTA'!$C$1730:$C$1746,'CETAK NOTA'!$D$6:$D$21:'CETAK NOTA'!$D$1730:$D$1746,E231,'CETAK NOTA'!$B$6:$B$21:'CETAK NOTA'!$B$1730:$B$1746,B231)","v":0},null,{"$f":"SUMIFS('CETAK NOTA'!$C$6:$C$21:'CETAK NOTA'!$C$1730:$C$1746,'CETAK NOTA'!$D$6:$D$21:'CETAK NOTA'!$D$1730:$D$1746,G231,'CETAK NOTA'!$B$6:$B$21:'CETAK NOTA'!$B$1730:$B$1746,B231)","v":0}]
[null,null,"",{"$f":"SUMIFS('CETAK NOTA'!$C$6:$C$21:'CETAK NOTA'!$C$1730:$C$1746,'CETAK NOTA'!$D$6:$D$21:'CETAK NOTA'!$D$1730:$D$1746,E232,'CETAK NOTA'!$B$6:$B$21:'CETAK NOTA'!$B$1730:$B$1746,B232)","v":0},null,{"$f":"SUMIFS('CETAK NOTA'!$C$6:$C$21:'CETAK NOTA'!$C$1730:$C$1746,'CETAK NOTA'!$D$6:$D$21:'CETAK NOTA'!$D$1730:$D$1746,G232,'CETAK NOTA'!$B$6:$B$21:'CETAK NOTA'!$B$1730:$B$1746,B232)","v":0}]
[null,null,"",{"$f":"SUMIFS('CETAK NOTA'!$C$6:$C$21:'CETAK NOTA'!$C$1730:$C$1746,'CETAK NOTA'!$D$6:$D$21:'CETAK NOTA'!$D$1730:$D$1746,E233,'CETAK NOTA'!$B$6:$B$21:'CETAK NOTA'!$B$1730:$B$1746,B233)","v":0},null,{"$f":"SUMIFS('CETAK NOTA'!$C$6:$C$21:'CETAK NOTA'!$C$1730:$C$1746,'CETAK NOTA'!$D$6:$D$21:'CETAK NOTA'!$D$1730:$D$1746,G233,'CETAK NOTA'!$B$6:$B$21:'CETAK NOTA'!$B$1730:$B$1746,B233)","v":0}]
[null,null,"",{"$f":"SUMIFS('CETAK NOTA'!$C$6:$C$21:'CETAK NOTA'!$C$1730:$C$1746,'CETAK NOTA'!$D$6:$D$21:'CETAK NOTA'!$D$1730:$D$1746,E234,'CETAK NOTA'!$B$6:$B$21:'CETAK NOTA'!$B$1730:$B$1746,B234)","v":0},null,{"$f":"SUMIFS('CETAK NOTA'!$C$6:$C$21:'CETAK NOTA'!$C$1730:$C$1746,'CETAK NOTA'!$D$6:$D$21:'CETAK NOTA'!$D$1730:$D$1746,G234,'CETAK NOTA'!$B$6:$B$21:'CETAK NOTA'!$B$1730:$B$1746,B234)","v":0}]
[null,null,"",{"$f":"SUMIFS('CETAK NOTA'!$C$6:$C$21:'CETAK NOTA'!$C$1730:$C$1746,'CETAK NOTA'!$D$6:$D$21:'CETAK NOTA'!$D$1730:$D$1746,E235,'CETAK NOTA'!$B$6:$B$21:'CETAK NOTA'!$B$1730:$B$1746,B235)","v":0},null,{"$f":"SUMIFS('CETAK NOTA'!$C$6:$C$21:'CETAK NOTA'!$C$1730:$C$1746,'CETAK NOTA'!$D$6:$D$21:'CETAK NOTA'!$D$1730:$D$1746,G235,'CETAK NOTA'!$B$6:$B$21:'CETAK NOTA'!$B$1730:$B$1746,B235)","v":0}]
[null,null,"",{"$f":"SUMIFS('CETAK NOTA'!$C$6:$C$21:'CETAK NOTA'!$C$1730:$C$1746,'CETAK NOTA'!$D$6:$D$21:'CETAK NOTA'!$D$1730:$D$1746,E236,'CETAK NOTA'!$B$6:$B$21:'CETAK NOTA'!$B$1730:$B$1746,B236)","v":0},null,{"$f":"SUMIFS('CETAK NOTA'!$C$6:$C$21:'CETAK NOTA'!$C$1730:$C$1746,'CETAK NOTA'!$D$6:$D$21:'CETAK NOTA'!$D$1730:$D$1746,G236,'CETAK NOTA'!$B$6:$B$21:'CETAK NOTA'!$B$1730:$B$1746,B236)","v":0}]
[null,null,"",{"$f":"SUMIFS('CETAK NOTA'!$C$6:$C$21:'CETAK NOTA'!$C$1730:$C$1746,'CETAK NOTA'!$D$6:$D$21:'CETAK NOTA'!$D$1730:$D$1746,E237,'CETAK NOTA'!$B$6:$B$21:'CETAK NOTA'!$B$1730:$B$1746,B237)","v":0},null,{"$f":"SUMIFS('CETAK NOTA'!$C$6:$C$21:'CETAK NOTA'!$C$1730:$C$1746,'CETAK NOTA'!$D$6:$D$21:'CETAK NOTA'!$D$1730:$D$1746,G237,'CETAK NOTA'!$B$6:$B$21:'CETAK NOTA'!$B$1730:$B$1746,B237)","v":0}]
[null,null,"",{"$f":"SUMIFS('CETAK NOTA'!$C$6:$C$21:'CETAK NOTA'!$C$1730:$C$1746,'CETAK NOTA'!$D$6:$D$21:'CETAK NOTA'!$D$1730:$D$1746,E238,'CETAK NOTA'!$B$6:$B$21:'CETAK NOTA'!$B$1730:$B$1746,B238)","v":0},null,{"$f":"SUMIFS('CETAK NOTA'!$C$6:$C$21:'CETAK NOTA'!$C$1730:$C$1746,'CETAK NOTA'!$D$6:$D$21:'CETAK NOTA'!$D$1730:$D$1746,G238,'CETAK NOTA'!$B$6:$B$21:'CETAK NOTA'!$B$1730:$B$1746,B238)","v":0}]
[null,null,"",{"$f":"SUMIFS('CETAK NOTA'!$C$6:$C$21:'CETAK NOTA'!$C$1730:$C$1746,'CETAK NOTA'!$D$6:$D$21:'CETAK NOTA'!$D$1730:$D$1746,E239,'CETAK NOTA'!$B$6:$B$21:'CETAK NOTA'!$B$1730:$B$1746,B239)","v":0},null,{"$f":"SUMIFS('CETAK NOTA'!$C$6:$C$21:'CETAK NOTA'!$C$1730:$C$1746,'CETAK NOTA'!$D$6:$D$21:'CETAK NOTA'!$D$1730:$D$1746,G239,'CETAK NOTA'!$B$6:$B$21:'CETAK NOTA'!$B$1730:$B$1746,B239)","v":0}]
[null,null,"",{"$f":"SUMIFS('CETAK NOTA'!$C$6:$C$21:'CETAK NOTA'!$C$1730:$C$1746,'CETAK NOTA'!$D$6:$D$21:'CETAK NOTA'!$D$1730:$D$1746,E240,'CETAK NOTA'!$B$6:$B$21:'CETAK NOTA'!$B$1730:$B$1746,B240)","v":0},null,{"$f":"SUMIFS('CETAK NOTA'!$C$6:$C$21:'CETAK NOTA'!$C$1730:$C$1746,'CETAK NOTA'!$D$6:$D$21:'CETAK NOTA'!$D$1730:$D$1746,G240,'CETAK NOTA'!$B$6:$B$21:'CETAK NOTA'!$B$1730:$B$1746,B240)","v":0}]
[null,null,"",{"$f":"SUMIFS('CETAK NOTA'!$C$6:$C$21:'CETAK NOTA'!$C$1730:$C$1746,'CETAK NOTA'!$D$6:$D$21:'CETAK NOTA'!$D$1730:$D$1746,E241,'CETAK NOTA'!$B$6:$B$21:'CETAK NOTA'!$B$1730:$B$1746,B241)","v":0},null,{"$f":"SUMIFS('CETAK NOTA'!$C$6:$C$21:'CETAK NOTA'!$C$1730:$C$1746,'CETAK NOTA'!$D$6:$D$21:'CETAK NOTA'!$D$1730:$D$1746,G241,'CETAK NOTA'!$B$6:$B$21:'CETAK NOTA'!$B$1730:$B$1746,B241)","v":0}]
[null,null,"",{"$f":"SUMIFS('CETAK NOTA'!$C$6:$C$21:'CETAK NOTA'!$C$1730:$C$1746,'CETAK NOTA'!$D$6:$D$21:'CETAK NOTA'!$D$1730:$D$1746,E242,'CETAK NOTA'!$B$6:$B$21:'CETAK NOTA'!$B$1730:$B$1746,B242)","v":0},null,{"$f":"SUMIFS('CETAK NOTA'!$C$6:$C$21:'CETAK NOTA'!$C$1730:$C$1746,'CETAK NOTA'!$D$6:$D$21:'CETAK NOTA'!$D$1730:$D$1746,G242,'CETAK NOTA'!$B$6:$B$21:'CETAK NOTA'!$B$1730:$B$1746,B242)","v":0}]
[null,null,"",{"$f":"SUMIFS('CETAK NOTA'!$C$6:$C$21:'CETAK NOTA'!$C$1730:$C$1746,'CETAK NOTA'!$D$6:$D$21:'CETAK NOTA'!$D$1730:$D$1746,E243,'CETAK NOTA'!$B$6:$B$21:'CETAK NOTA'!$B$1730:$B$1746,B243)","v":0},null,{"$f":"SUMIFS('CETAK NOTA'!$C$6:$C$21:'CETAK NOTA'!$C$1730:$C$1746,'CETAK NOTA'!$D$6:$D$21:'CETAK NOTA'!$D$1730:$D$1746,G243,'CETAK NOTA'!$B$6:$B$21:'CETAK NOTA'!$B$1730:$B$1746,B243)","v":0}]
[null,null,"",{"$f":"SUMIFS('CETAK NOTA'!$C$6:$C$21:'CETAK NOTA'!$C$1730:$C$1746,'CETAK NOTA'!$D$6:$D$21:'CETAK NOTA'!$D$1730:$D$1746,E244,'CETAK NOTA'!$B$6:$B$21:'CETAK NOTA'!$B$1730:$B$1746,B244)","v":0},null,{"$f":"SUMIFS('CETAK NOTA'!$C$6:$C$21:'CETAK NOTA'!$C$1730:$C$1746,'CETAK NOTA'!$D$6:$D$21:'CETAK NOTA'!$D$1730:$D$1746,G244,'CETAK NOTA'!$B$6:$B$21:'CETAK NOTA'!$B$1730:$B$1746,B244)","v":0}]
[null,null,"",{"$f":"SUMIFS('CETAK NOTA'!$C$6:$C$21:'CETAK NOTA'!$C$1730:$C$1746,'CETAK NOTA'!$D$6:$D$21:'CETAK NOTA'!$D$1730:$D$1746,E245,'CETAK NOTA'!$B$6:$B$21:'CETAK NOTA'!$B$1730:$B$1746,B245)","v":0},null,{"$f":"SUMIFS('CETAK NOTA'!$C$6:$C$21:'CETAK NOTA'!$C$1730:$C$1746,'CETAK NOTA'!$D$6:$D$21:'CETAK NOTA'!$D$1730:$D$1746,G245,'CETAK NOTA'!$B$6:$B$21:'CETAK NOTA'!$B$1730:$B$1746,B245)","v":0}]
[null,null,"",{"$f":"SUMIFS('CETAK NOTA'!$C$6:$C$21:'CETAK NOTA'!$C$1730:$C$1746,'CETAK NOTA'!$D$6:$D$21:'CETAK NOTA'!$D$1730:$D$1746,E246,'CETAK NOTA'!$B$6:$B$21:'CETAK NOTA'!$B$1730:$B$1746,B246)","v":0},null,{"$f":"SUMIFS('CETAK NOTA'!$C$6:$C$21:'CETAK NOTA'!$C$1730:$C$1746,'CETAK NOTA'!$D$6:$D$21:'CETAK NOTA'!$D$1730:$D$1746,G246,'CETAK NOTA'!$B$6:$B$21:'CETAK NOTA'!$B$1730:$B$1746,B246)","v":0}]
[null,null,"",{"$f":"SUMIFS('CETAK NOTA'!$C$6:$C$21:'CETAK NOTA'!$C$1730:$C$1746,'CETAK NOTA'!$D$6:$D$21:'CETAK NOTA'!$D$1730:$D$1746,E247,'CETAK NOTA'!$B$6:$B$21:'CETAK NOTA'!$B$1730:$B$1746,B247)","v":0},null,{"$f":"SUMIFS('CETAK NOTA'!$C$6:$C$21:'CETAK NOTA'!$C$1730:$C$1746,'CETAK NOTA'!$D$6:$D$21:'CETAK NOTA'!$D$1730:$D$1746,G247,'CETAK NOTA'!$B$6:$B$21:'CETAK NOTA'!$B$1730:$B$1746,B247)","v":0}]
[null,null,"",{"$f":"SUMIFS('CETAK NOTA'!$C$6:$C$21:'CETAK NOTA'!$C$1730:$C$1746,'CETAK NOTA'!$D$6:$D$21:'CETAK NOTA'!$D$1730:$D$1746,E248,'CETAK NOTA'!$B$6:$B$21:'CETAK NOTA'!$B$1730:$B$1746,B248)","v":0},null,{"$f":"SUMIFS('CETAK NOTA'!$C$6:$C$21:'CETAK NOTA'!$C$1730:$C$1746,'CETAK NOTA'!$D$6:$D$21:'CETAK NOTA'!$D$1730:$D$1746,G248,'CETAK NOTA'!$B$6:$B$21:'CETAK NOTA'!$B$1730:$B$1746,B248)","v":0}]
[null,null,"",{"$f":"SUMIFS('CETAK NOTA'!$C$6:$C$21:'CETAK NOTA'!$C$1730:$C$1746,'CETAK NOTA'!$D$6:$D$21:'CETAK NOTA'!$D$1730:$D$1746,E249,'CETAK NOTA'!$B$6:$B$21:'CETAK NOTA'!$B$1730:$B$1746,B249)","v":0},null,{"$f":"SUMIFS('CETAK NOTA'!$C$6:$C$21:'CETAK NOTA'!$C$1730:$C$1746,'CETAK NOTA'!$D$6:$D$21:'CETAK NOTA'!$D$1730:$D$1746,G249,'CETAK NOTA'!$B$6:$B$21:'CETAK NOTA'!$B$1730:$B$1746,B249)","v":0}]
[null,null,"",{"$f":"SUMIFS('CETAK NOTA'!$C$6:$C$21:'CETAK NOTA'!$C$1730:$C$1746,'CETAK NOTA'!$D$6:$D$21:'CETAK NOTA'!$D$1730:$D$1746,E250,'CETAK NOTA'!$B$6:$B$21:'CETAK NOTA'!$B$1730:$B$1746,B250)","v":0},null,{"$f":"SUMIFS('CETAK NOTA'!$C$6:$C$21:'CETAK NOTA'!$C$1730:$C$1746,'CETAK NOTA'!$D$6:$D$21:'CETAK NOTA'!$D$1730:$D$1746,G250,'CETAK NOTA'!$B$6:$B$21:'CETAK NOTA'!$B$1730:$B$1746,B250)","v":0}]
[null,null,"",{"$f":"SUMIFS('CETAK NOTA'!$C$6:$C$21:'CETAK NOTA'!$C$1730:$C$1746,'CETAK NOTA'!$D$6:$D$21:'CETAK NOTA'!$D$1730:$D$1746,E251,'CETAK NOTA'!$B$6:$B$21:'CETAK NOTA'!$B$1730:$B$1746,B251)","v":0},null,{"$f":"SUMIFS('CETAK NOTA'!$C$6:$C$21:'CETAK NOTA'!$C$1730:$C$1746,'CETAK NOTA'!$D$6:$D$21:'CETAK NOTA'!$D$1730:$D$1746,G251,'CETAK NOTA'!$B$6:$B$21:'CETAK NOTA'!$B$1730:$B$1746,B251)","v":0}]
[null,null,"",{"$f":"SUMIFS('CETAK NOTA'!$C$6:$C$21:'CETAK NOTA'!$C$1730:$C$1746,'CETAK NOTA'!$D$6:$D$21:'CETAK NOTA'!$D$1730:$D$1746,E252,'CETAK NOTA'!$B$6:$B$21:'CETAK NOTA'!$B$1730:$B$1746,B252)","v":0},null,{"$f":"SUMIFS('CETAK NOTA'!$C$6:$C$21:'CETAK NOTA'!$C$1730:$C$1746,'CETAK NOTA'!$D$6:$D$21:'CETAK NOTA'!$D$1730:$D$1746,G252,'CETAK NOTA'!$B$6:$B$21:'CETAK NOTA'!$B$1730:$B$1746,B252)","v":0}]
[null,null,"",{"$f":"SUMIFS('CETAK NOTA'!$C$6:$C$21:'CETAK NOTA'!$C$1730:$C$1746,'CETAK NOTA'!$D$6:$D$21:'CETAK NOTA'!$D$1730:$D$1746,E253,'CETAK NOTA'!$B$6:$B$21:'CETAK NOTA'!$B$1730:$B$1746,B253)","v":0},null,{"$f":"SUMIFS('CETAK NOTA'!$C$6:$C$21:'CETAK NOTA'!$C$1730:$C$1746,'CETAK NOTA'!$D$6:$D$21:'CETAK NOTA'!$D$1730:$D$1746,G253,'CETAK NOTA'!$B$6:$B$21:'CETAK NOTA'!$B$1730:$B$1746,B253)","v":0}]
[null,null,"",{"$f":"SUMIFS('CETAK NOTA'!$C$6:$C$21:'CETAK NOTA'!$C$1730:$C$1746,'CETAK NOTA'!$D$6:$D$21:'CETAK NOTA'!$D$1730:$D$1746,E254,'CETAK NOTA'!$B$6:$B$21:'CETAK NOTA'!$B$1730:$B$1746,B254)","v":0},null,{"$f":"SUMIFS('CETAK NOTA'!$C$6:$C$21:'CETAK NOTA'!$C$1730:$C$1746,'CETAK NOTA'!$D$6:$D$21:'CETAK NOTA'!$D$1730:$D$1746,G254,'CETAK NOTA'!$B$6:$B$21:'CETAK NOTA'!$B$1730:$B$1746,B254)","v":0}]
[null,null,"",{"$f":"SUMIFS('CETAK NOTA'!$C$6:$C$21:'CETAK NOTA'!$C$1730:$C$1746,'CETAK NOTA'!$D$6:$D$21:'CETAK NOTA'!$D$1730:$D$1746,E255,'CETAK NOTA'!$B$6:$B$21:'CETAK NOTA'!$B$1730:$B$1746,B255)","v":0},null,{"$f":"SUMIFS('CETAK NOTA'!$C$6:$C$21:'CETAK NOTA'!$C$1730:$C$1746,'CETAK NOTA'!$D$6:$D$21:'CETAK NOTA'!$D$1730:$D$1746,G255,'CETAK NOTA'!$B$6:$B$21:'CETAK NOTA'!$B$1730:$B$1746,B255)","v":0}]
[null,null,"",{"$f":"SUMIFS('CETAK NOTA'!$C$6:$C$21:'CETAK NOTA'!$C$1730:$C$1746,'CETAK NOTA'!$D$6:$D$21:'CETAK NOTA'!$D$1730:$D$1746,E256,'CETAK NOTA'!$B$6:$B$21:'CETAK NOTA'!$B$1730:$B$1746,B256)","v":0},null,{"$f":"SUMIFS('CETAK NOTA'!$C$6:$C$21:'CETAK NOTA'!$C$1730:$C$1746,'CETAK NOTA'!$D$6:$D$21:'CETAK NOTA'!$D$1730:$D$1746,G256,'CETAK NOTA'!$B$6:$B$21:'CETAK NOTA'!$B$1730:$B$1746,B256)","v":0}]
[null,null,"",{"$f":"SUMIFS('CETAK NOTA'!$C$6:$C$21:'CETAK NOTA'!$C$1730:$C$1746,'CETAK NOTA'!$D$6:$D$21:'CETAK NOTA'!$D$1730:$D$1746,E257,'CETAK NOTA'!$B$6:$B$21:'CETAK NOTA'!$B$1730:$B$1746,B257)","v":0},null,{"$f":"SUMIFS('CETAK NOTA'!$C$6:$C$21:'CETAK NOTA'!$C$1730:$C$1746,'CETAK NOTA'!$D$6:$D$21:'CETAK NOTA'!$D$1730:$D$1746,G257,'CETAK NOTA'!$B$6:$B$21:'CETAK NOTA'!$B$1730:$B$1746,B257)","v":0}]
[null,null,{"$f":"IF(AND(K258=0,L258=0),\"\",IF(AND(D258>0,K258>L258),\"RM\",\"TK\"))","v":""},{"$f":"SUMIFS('CETAK NOTA'!$C$6:$C$21:'CETAK NOTA'!$C$1730:$C$1746,'CETAK NOTA'!$D$6:$D$21:'CETAK NOTA'!$D$1730:$D$1746,E258,'CETAK NOTA'!$B$6:$B$21:'CETAK NOTA'!$B$1730:$B$1746,B258)","v":0},null,{"$f":"SUMIFS('CETAK NOTA'!$C$6:$C$21:'CETAK NOTA'!$C$1730:$C$1746,'CETAK NOTA'!$D$6:$D$21:'CETAK NOTA'!$D$1730:$D$1746,G258,'CETAK NOTA'!$B$6:$B$21:'CETAK NOTA'!$B$1730:$B$1746,B258)","v":0}]
[null,null,"",{"$f":"SUMIFS('CETAK NOTA'!$C$6:$C$21:'CETAK NOTA'!$C$1730:$C$1746,'CETAK NOTA'!$D$6:$D$21:'CETAK NOTA'!$D$1730:$D$1746,E259,'CETAK NOTA'!$B$6:$B$21:'CETAK NOTA'!$B$1730:$B$1746,B259)","v":0},null,{"$f":"SUMIFS('CETAK NOTA'!$C$6:$C$21:'CETAK NOTA'!$C$1730:$C$1746,'CETAK NOTA'!$D$6:$D$21:'CETAK NOTA'!$D$1730:$D$1746,G259,'CETAK NOTA'!$B$6:$B$21:'CETAK NOTA'!$B$1730:$B$1746,B259)","v":0}]
[null,null,"",{"$f":"SUMIFS('CETAK NOTA'!$C$6:$C$21:'CETAK NOTA'!$C$1730:$C$1746,'CETAK NOTA'!$D$6:$D$21:'CETAK NOTA'!$D$1730:$D$1746,E260,'CETAK NOTA'!$B$6:$B$21:'CETAK NOTA'!$B$1730:$B$1746,B260)","v":0},null,{"$f":"SUMIFS('CETAK NOTA'!$C$6:$C$21:'CETAK NOTA'!$C$1730:$C$1746,'CETAK NOTA'!$D$6:$D$21:'CETAK NOTA'!$D$1730:$D$1746,G260,'CETAK NOTA'!$B$6:$B$21:'CETAK NOTA'!$B$1730:$B$1746,B260)","v":0}]
[null,null,"",{"$f":"SUMIFS('CETAK NOTA'!$C$6:$C$21:'CETAK NOTA'!$C$1730:$C$1746,'CETAK NOTA'!$D$6:$D$21:'CETAK NOTA'!$D$1730:$D$1746,E261,'CETAK NOTA'!$B$6:$B$21:'CETAK NOTA'!$B$1730:$B$1746,B261)","v":0},null,{"$f":"SUMIFS('CETAK NOTA'!$C$6:$C$21:'CETAK NOTA'!$C$1730:$C$1746,'CETAK NOTA'!$D$6:$D$21:'CETAK NOTA'!$D$1730:$D$1746,G261,'CETAK NOTA'!$B$6:$B$21:'CETAK NOTA'!$B$1730:$B$1746,B261)","v":0}]
[null,null,"",{"$f":"SUMIFS('CETAK NOTA'!$C$6:$C$21:'CETAK NOTA'!$C$1730:$C$1746,'CETAK NOTA'!$D$6:$D$21:'CETAK NOTA'!$D$1730:$D$1746,E262,'CETAK NOTA'!$B$6:$B$21:'CETAK NOTA'!$B$1730:$B$1746,B262)","v":0},null,{"$f":"SUMIFS('CETAK NOTA'!$C$6:$C$21:'CETAK NOTA'!$C$1730:$C$1746,'CETAK NOTA'!$D$6:$D$21:'CETAK NOTA'!$D$1730:$D$1746,G262,'CETAK NOTA'!$B$6:$B$21:'CETAK NOTA'!$B$1730:$B$1746,B262)","v":0}]
[null,null,"",{"$f":"SUMIFS('CETAK NOTA'!$C$6:$C$21:'CETAK NOTA'!$C$1730:$C$1746,'CETAK NOTA'!$D$6:$D$21:'CETAK NOTA'!$D$1730:$D$1746,E263,'CETAK NOTA'!$B$6:$B$21:'CETAK NOTA'!$B$1730:$B$1746,B263)","v":0},null,{"$f":"SUMIFS('CETAK NOTA'!$C$6:$C$21:'CETAK NOTA'!$C$1730:$C$1746,'CETAK NOTA'!$D$6:$D$21:'CETAK NOTA'!$D$1730:$D$1746,G263,'CETAK NOTA'!$B$6:$B$21:'CETAK NOTA'!$B$1730:$B$1746,B263)","v":0}]
[null,null,"",{"$f":"SUMIFS('CETAK NOTA'!$C$6:$C$21:'CETAK NOTA'!$C$1730:$C$1746,'CETAK NOTA'!$D$6:$D$21:'CETAK NOTA'!$D$1730:$D$1746,E264,'CETAK NOTA'!$B$6:$B$21:'CETAK NOTA'!$B$1730:$B$1746,B264)","v":0},null,{"$f":"SUMIFS('CETAK NOTA'!$C$6:$C$21:'CETAK NOTA'!$C$1730:$C$1746,'CETAK NOTA'!$D$6:$D$21:'CETAK NOTA'!$D$1730:$D$1746,G264,'CETAK NOTA'!$B$6:$B$21:'CETAK NOTA'!$B$1730:$B$1746,B264)","v":0}]
[null,null,"",{"$f":"SUMIFS('CETAK NOTA'!$C$6:$C$21:'CETAK NOTA'!$C$1730:$C$1746,'CETAK NOTA'!$D$6:$D$21:'CETAK NOTA'!$D$1730:$D$1746,E265,'CETAK NOTA'!$B$6:$B$21:'CETAK NOTA'!$B$1730:$B$1746,B265)","v":0},null,{"$f":"SUMIFS('CETAK NOTA'!$C$6:$C$21:'CETAK NOTA'!$C$1730:$C$1746,'CETAK NOTA'!$D$6:$D$21:'CETAK NOTA'!$D$1730:$D$1746,G265,'CETAK NOTA'!$B$6:$B$21:'CETAK NOTA'!$B$1730:$B$1746,B265)","v":0}]
[null,null,"",{"$f":"SUMIFS('CETAK NOTA'!$C$6:$C$21:'CETAK NOTA'!$C$1730:$C$1746,'CETAK NOTA'!$D$6:$D$21:'CETAK NOTA'!$D$1730:$D$1746,E266,'CETAK NOTA'!$B$6:$B$21:'CETAK NOTA'!$B$1730:$B$1746,B266)","v":0},null,{"$f":"SUMIFS('CETAK NOTA'!$C$6:$C$21:'CETAK NOTA'!$C$1730:$C$1746,'CETAK NOTA'!$D$6:$D$21:'CETAK NOTA'!$D$1730:$D$1746,G266,'CETAK NOTA'!$B$6:$B$21:'CETAK NOTA'!$B$1730:$B$1746,B266)","v":0}]
[null,null,"",{"$f":"SUMIFS('CETAK NOTA'!$C$6:$C$21:'CETAK NOTA'!$C$1730:$C$1746,'CETAK NOTA'!$D$6:$D$21:'CETAK NOTA'!$D$1730:$D$1746,E267,'CETAK NOTA'!$B$6:$B$21:'CETAK NOTA'!$B$1730:$B$1746,B267)","v":0},null,{"$f":"SUMIFS('CETAK NOTA'!$C$6:$C$21:'CETAK NOTA'!$C$1730:$C$1746,'CETAK NOTA'!$D$6:$D$21:'CETAK NOTA'!$D$1730:$D$1746,G267,'CETAK NOTA'!$B$6:$B$21:'CETAK NOTA'!$B$1730:$B$1746,B267)","v":0}]
[null,null,"",{"$f":"SUMIFS('CETAK NOTA'!$C$6:$C$21:'CETAK NOTA'!$C$1730:$C$1746,'CETAK NOTA'!$D$6:$D$21:'CETAK NOTA'!$D$1730:$D$1746,E268,'CETAK NOTA'!$B$6:$B$21:'CETAK NOTA'!$B$1730:$B$1746,B268)","v":0},null,{"$f":"SUMIFS('CETAK NOTA'!$C$6:$C$21:'CETAK NOTA'!$C$1730:$C$1746,'CETAK NOTA'!$D$6:$D$21:'CETAK NOTA'!$D$1730:$D$1746,G268,'CETAK NOTA'!$B$6:$B$21:'CETAK NOTA'!$B$1730:$B$1746,B268)","v":0}]
[null,null,"",{"$f":"SUMIFS('CETAK NOTA'!$C$6:$C$21:'CETAK NOTA'!$C$1730:$C$1746,'CETAK NOTA'!$D$6:$D$21:'CETAK NOTA'!$D$1730:$D$1746,E269,'CETAK NOTA'!$B$6:$B$21:'CETAK NOTA'!$B$1730:$B$1746,B269)","v":0},null,{"$f":"SUMIFS('CETAK NOTA'!$C$6:$C$21:'CETAK NOTA'!$C$1730:$C$1746,'CETAK NOTA'!$D$6:$D$21:'CETAK NOTA'!$D$1730:$D$1746,G269,'CETAK NOTA'!$B$6:$B$21:'CETAK NOTA'!$B$1730:$B$1746,B269)","v":0}]
[null,null,"",{"$f":"SUMIFS('CETAK NOTA'!$C$6:$C$21:'CETAK NOTA'!$C$1730:$C$1746,'CETAK NOTA'!$D$6:$D$21:'CETAK NOTA'!$D$1730:$D$1746,E270,'CETAK NOTA'!$B$6:$B$21:'CETAK NOTA'!$B$1730:$B$1746,B270)","v":0},null,{"$f":"SUMIFS('CETAK NOTA'!$C$6:$C$21:'CETAK NOTA'!$C$1730:$C$1746,'CETAK NOTA'!$D$6:$D$21:'CETAK NOTA'!$D$1730:$D$1746,G270,'CETAK NOTA'!$B$6:$B$21:'CETAK NOTA'!$B$1730:$B$1746,B270)","v":0}]
[null,null,"",{"$f":"SUMIFS('CETAK NOTA'!$C$6:$C$21:'CETAK NOTA'!$C$1730:$C$1746,'CETAK NOTA'!$D$6:$D$21:'CETAK NOTA'!$D$1730:$D$1746,E271,'CETAK NOTA'!$B$6:$B$21:'CETAK NOTA'!$B$1730:$B$1746,B271)","v":0},null,{"$f":"SUMIFS('CETAK NOTA'!$C$6:$C$21:'CETAK NOTA'!$C$1730:$C$1746,'CETAK NOTA'!$D$6:$D$21:'CETAK NOTA'!$D$1730:$D$1746,G271,'CETAK NOTA'!$B$6:$B$21:'CETAK NOTA'!$B$1730:$B$1746,B271)","v":0}]
[null,null,"",{"$f":"SUMIFS('CETAK NOTA'!$C$6:$C$21:'CETAK NOTA'!$C$1730:$C$1746,'CETAK NOTA'!$D$6:$D$21:'CETAK NOTA'!$D$1730:$D$1746,E272,'CETAK NOTA'!$B$6:$B$21:'CETAK NOTA'!$B$1730:$B$1746,B272)","v":0},null,{"$f":"SUMIFS('CETAK NOTA'!$C$6:$C$21:'CETAK NOTA'!$C$1730:$C$1746,'CETAK NOTA'!$D$6:$D$21:'CETAK NOTA'!$D$1730:$D$1746,G272,'CETAK NOTA'!$B$6:$B$21:'CETAK NOTA'!$B$1730:$B$1746,B272)","v":0}]
[null,null,"",{"$f":"SUMIFS('CETAK NOTA'!$C$6:$C$21:'CETAK NOTA'!$C$1730:$C$1746,'CETAK NOTA'!$D$6:$D$21:'CETAK NOTA'!$D$1730:$D$1746,E273,'CETAK NOTA'!$B$6:$B$21:'CETAK NOTA'!$B$1730:$B$1746,B273)","v":0},null,{"$f":"SUMIFS('CETAK NOTA'!$C$6:$C$21:'CETAK NOTA'!$C$1730:$C$1746,'CETAK NOTA'!$D$6:$D$21:'CETAK NOTA'!$D$1730:$D$1746,G273,'CETAK NOTA'!$B$6:$B$21:'CETAK NOTA'!$B$1730:$B$1746,B273)","v":0}]
[null,null,"",{"$f":"SUMIFS('CETAK NOTA'!$C$6:$C$21:'CETAK NOTA'!$C$1730:$C$1746,'CETAK NOTA'!$D$6:$D$21:'CETAK NOTA'!$D$1730:$D$1746,E274,'CETAK NOTA'!$B$6:$B$21:'CETAK NOTA'!$B$1730:$B$1746,B274)","v":0},null,{"$f":"SUMIFS('CETAK NOTA'!$C$6:$C$21:'CETAK NOTA'!$C$1730:$C$1746,'CETAK NOTA'!$D$6:$D$21:'CETAK NOTA'!$D$1730:$D$1746,G274,'CETAK NOTA'!$B$6:$B$21:'CETAK NOTA'!$B$1730:$B$1746,B274)","v":0}]
[null,null,"",{"$f":"SUMIFS('CETAK NOTA'!$C$6:$C$21:'CETAK NOTA'!$C$1730:$C$1746,'CETAK NOTA'!$D$6:$D$21:'CETAK NOTA'!$D$1730:$D$1746,E275,'CETAK NOTA'!$B$6:$B$21:'CETAK NOTA'!$B$1730:$B$1746,B275)","v":0},null,{"$f":"SUMIFS('CETAK NOTA'!$C$6:$C$21:'CETAK NOTA'!$C$1730:$C$1746,'CETAK NOTA'!$D$6:$D$21:'CETAK NOTA'!$D$1730:$D$1746,G275,'CETAK NOTA'!$B$6:$B$21:'CETAK NOTA'!$B$1730:$B$1746,B275)","v":0}]
[null,null,"",{"$f":"SUMIFS('CETAK NOTA'!$C$6:$C$21:'CETAK NOTA'!$C$1730:$C$1746,'CETAK NOTA'!$D$6:$D$21:'CETAK NOTA'!$D$1730:$D$1746,E276,'CETAK NOTA'!$B$6:$B$21:'CETAK NOTA'!$B$1730:$B$1746,B276)","v":0},null,{"$f":"SUMIFS('CETAK NOTA'!$C$6:$C$21:'CETAK NOTA'!$C$1730:$C$1746,'CETAK NOTA'!$D$6:$D$21:'CETAK NOTA'!$D$1730:$D$1746,G276,'CETAK NOTA'!$B$6:$B$21:'CETAK NOTA'!$B$1730:$B$1746,B276)","v":0}]
[null,null,"",{"$f":"SUMIFS('CETAK NOTA'!$C$6:$C$21:'CETAK NOTA'!$C$1730:$C$1746,'CETAK NOTA'!$D$6:$D$21:'CETAK NOTA'!$D$1730:$D$1746,E277,'CETAK NOTA'!$B$6:$B$21:'CETAK NOTA'!$B$1730:$B$1746,B277)","v":0},null,{"$f":"SUMIFS('CETAK NOTA'!$C$6:$C$21:'CETAK NOTA'!$C$1730:$C$1746,'CETAK NOTA'!$D$6:$D$21:'CETAK NOTA'!$D$1730:$D$1746,G277,'CETAK NOTA'!$B$6:$B$21:'CETAK NOTA'!$B$1730:$B$1746,B277)","v":0}]
[null,null,"",{"$f":"SUMIFS('CETAK NOTA'!$C$6:$C$21:'CETAK NOTA'!$C$1730:$C$1746,'CETAK NOTA'!$D$6:$D$21:'CETAK NOTA'!$D$1730:$D$1746,E278,'CETAK NOTA'!$B$6:$B$21:'CETAK NOTA'!$B$1730:$B$1746,B278)","v":0},null,{"$f":"SUMIFS('CETAK NOTA'!$C$6:$C$21:'CETAK NOTA'!$C$1730:$C$1746,'CETAK NOTA'!$D$6:$D$21:'CETAK NOTA'!$D$1730:$D$1746,G278,'CETAK NOTA'!$B$6:$B$21:'CETAK NOTA'!$B$1730:$B$1746,B278)","v":0}]
[null,null,"",{"$f":"SUMIFS('CETAK NOTA'!$C$6:$C$21:'CETAK NOTA'!$C$1730:$C$1746,'CETAK NOTA'!$D$6:$D$21:'CETAK NOTA'!$D$1730:$D$1746,E279,'CETAK NOTA'!$B$6:$B$21:'CETAK NOTA'!$B$1730:$B$1746,B279)","v":0},null,{"$f":"SUMIFS('CETAK NOTA'!$C$6:$C$21:'CETAK NOTA'!$C$1730:$C$1746,'CETAK NOTA'!$D$6:$D$21:'CETAK NOTA'!$D$1730:$D$1746,G279,'CETAK NOTA'!$B$6:$B$21:'CETAK NOTA'!$B$1730:$B$1746,B279)","v":0}]
[null,null,"",{"$f":"SUMIFS('CETAK NOTA'!$C$6:$C$21:'CETAK NOTA'!$C$1730:$C$1746,'CETAK NOTA'!$D$6:$D$21:'CETAK NOTA'!$D$1730:$D$1746,E280,'CETAK NOTA'!$B$6:$B$21:'CETAK NOTA'!$B$1730:$B$1746,B280)","v":0},null,{"$f":"SUMIFS('CETAK NOTA'!$C$6:$C$21:'CETAK NOTA'!$C$1730:$C$1746,'CETAK NOTA'!$D$6:$D$21:'CETAK NOTA'!$D$1730:$D$1746,G280,'CETAK NOTA'!$B$6:$B$21:'CETAK NOTA'!$B$1730:$B$1746,B280)","v":0}]
[null,null,"",{"$f":"SUMIFS('CETAK NOTA'!$C$6:$C$21:'CETAK NOTA'!$C$1730:$C$1746,'CETAK NOTA'!$D$6:$D$21:'CETAK NOTA'!$D$1730:$D$1746,E281,'CETAK NOTA'!$B$6:$B$21:'CETAK NOTA'!$B$1730:$B$1746,B281)","v":0},null,{"$f":"SUMIFS('CETAK NOTA'!$C$6:$C$21:'CETAK NOTA'!$C$1730:$C$1746,'CETAK NOTA'!$D$6:$D$21:'CETAK NOTA'!$D$1730:$D$1746,G281,'CETAK NOTA'!$B$6:$B$21:'CETAK NOTA'!$B$1730:$B$1746,B281)","v":0}]
[null,null,"",{"$f":"SUMIFS('CETAK NOTA'!$C$6:$C$21:'CETAK NOTA'!$C$1730:$C$1746,'CETAK NOTA'!$D$6:$D$21:'CETAK NOTA'!$D$1730:$D$1746,E282,'CETAK NOTA'!$B$6:$B$21:'CETAK NOTA'!$B$1730:$B$1746,B282)","v":0},null,{"$f":"SUMIFS('CETAK NOTA'!$C$6:$C$21:'CETAK NOTA'!$C$1730:$C$1746,'CETAK NOTA'!$D$6:$D$21:'CETAK NOTA'!$D$1730:$D$1746,G282,'CETAK NOTA'!$B$6:$B$21:'CETAK NOTA'!$B$1730:$B$1746,B282)","v":0}]
[null,null,"",{"$f":"SUMIFS('CETAK NOTA'!$C$6:$C$21:'CETAK NOTA'!$C$1730:$C$1746,'CETAK NOTA'!$D$6:$D$21:'CETAK NOTA'!$D$1730:$D$1746,E283,'CETAK NOTA'!$B$6:$B$21:'CETAK NOTA'!$B$1730:$B$1746,B283)","v":0},null,{"$f":"SUMIFS('CETAK NOTA'!$C$6:$C$21:'CETAK NOTA'!$C$1730:$C$1746,'CETAK NOTA'!$D$6:$D$21:'CETAK NOTA'!$D$1730:$D$1746,G283,'CETAK NOTA'!$B$6:$B$21:'CETAK NOTA'!$B$1730:$B$1746,B283)","v":0}]
[null,null,"",{"$f":"SUMIFS('CETAK NOTA'!$C$6:$C$21:'CETAK NOTA'!$C$1730:$C$1746,'CETAK NOTA'!$D$6:$D$21:'CETAK NOTA'!$D$1730:$D$1746,E284,'CETAK NOTA'!$B$6:$B$21:'CETAK NOTA'!$B$1730:$B$1746,B284)","v":0},null,{"$f":"SUMIFS('CETAK NOTA'!$C$6:$C$21:'CETAK NOTA'!$C$1730:$C$1746,'CETAK NOTA'!$D$6:$D$21:'CETAK NOTA'!$D$1730:$D$1746,G284,'CETAK NOTA'!$B$6:$B$21:'CETAK NOTA'!$B$1730:$B$1746,B284)","v":0}]
[null,null,"",{"$f":"SUMIFS('CETAK NOTA'!$C$6:$C$21:'CETAK NOTA'!$C$1730:$C$1746,'CETAK NOTA'!$D$6:$D$21:'CETAK NOTA'!$D$1730:$D$1746,E285,'CETAK NOTA'!$B$6:$B$21:'CETAK NOTA'!$B$1730:$B$1746,B285)","v":0},null,{"$f":"SUMIFS('CETAK NOTA'!$C$6:$C$21:'CETAK NOTA'!$C$1730:$C$1746,'CETAK NOTA'!$D$6:$D$21:'CETAK NOTA'!$D$1730:$D$1746,G285,'CETAK NOTA'!$B$6:$B$21:'CETAK NOTA'!$B$1730:$B$1746,B285)","v":0}]
[null,null,"",{"$f":"SUMIFS('CETAK NOTA'!$C$6:$C$21:'CETAK NOTA'!$C$1730:$C$1746,'CETAK NOTA'!$D$6:$D$21:'CETAK NOTA'!$D$1730:$D$1746,E286,'CETAK NOTA'!$B$6:$B$21:'CETAK NOTA'!$B$1730:$B$1746,B286)","v":0},null,{"$f":"SUMIFS('CETAK NOTA'!$C$6:$C$21:'CETAK NOTA'!$C$1730:$C$1746,'CETAK NOTA'!$D$6:$D$21:'CETAK NOTA'!$D$1730:$D$1746,G286,'CETAK NOTA'!$B$6:$B$21:'CETAK NOTA'!$B$1730:$B$1746,B286)","v":0}]
[null,null,"",{"$f":"SUMIFS('CETAK NOTA'!$C$6:$C$21:'CETAK NOTA'!$C$1730:$C$1746,'CETAK NOTA'!$D$6:$D$21:'CETAK NOTA'!$D$1730:$D$1746,E287,'CETAK NOTA'!$B$6:$B$21:'CETAK NOTA'!$B$1730:$B$1746,B287)","v":0},null,{"$f":"SUMIFS('CETAK NOTA'!$C$6:$C$21:'CETAK NOTA'!$C$1730:$C$1746,'CETAK NOTA'!$D$6:$D$21:'CETAK NOTA'!$D$1730:$D$1746,G287,'CETAK NOTA'!$B$6:$B$21:'CETAK NOTA'!$B$1730:$B$1746,B287)","v":0}]
[null,null,"",{"$f":"SUMIFS('CETAK NOTA'!$C$6:$C$21:'CETAK NOTA'!$C$1730:$C$1746,'CETAK NOTA'!$D$6:$D$21:'CETAK NOTA'!$D$1730:$D$1746,E288,'CETAK NOTA'!$B$6:$B$21:'CETAK NOTA'!$B$1730:$B$1746,B288)","v":0},null,{"$f":"SUMIFS('CETAK NOTA'!$C$6:$C$21:'CETAK NOTA'!$C$1730:$C$1746,'CETAK NOTA'!$D$6:$D$21:'CETAK NOTA'!$D$1730:$D$1746,G288,'CETAK NOTA'!$B$6:$B$21:'CETAK NOTA'!$B$1730:$B$1746,B288)","v":0}]
[null,null,"",{"$f":"SUMIFS('CETAK NOTA'!$C$6:$C$21:'CETAK NOTA'!$C$1730:$C$1746,'CETAK NOTA'!$D$6:$D$21:'CETAK NOTA'!$D$1730:$D$1746,E289,'CETAK NOTA'!$B$6:$B$21:'CETAK NOTA'!$B$1730:$B$1746,B289)","v":0},null,{"$f":"SUMIFS('CETAK NOTA'!$C$6:$C$21:'CETAK NOTA'!$C$1730:$C$1746,'CETAK NOTA'!$D$6:$D$21:'CETAK NOTA'!$D$1730:$D$1746,G289,'CETAK NOTA'!$B$6:$B$21:'CETAK NOTA'!$B$1730:$B$1746,B289)","v":0}]
[null,null,"",{"$f":"SUMIFS('CETAK NOTA'!$C$6:$C$21:'CETAK NOTA'!$C$1730:$C$1746,'CETAK NOTA'!$D$6:$D$21:'CETAK NOTA'!$D$1730:$D$1746,E290,'CETAK NOTA'!$B$6:$B$21:'CETAK NOTA'!$B$1730:$B$1746,B290)","v":0},null,{"$f":"SUMIFS('CETAK NOTA'!$C$6:$C$21:'CETAK NOTA'!$C$1730:$C$1746,'CETAK NOTA'!$D$6:$D$21:'CETAK NOTA'!$D$1730:$D$1746,G290,'CETAK NOTA'!$B$6:$B$21:'CETAK NOTA'!$B$1730:$B$1746,B290)","v":0}]
[null,null,"",{"$f":"SUMIFS('CETAK NOTA'!$C$6:$C$21:'CETAK NOTA'!$C$1730:$C$1746,'CETAK NOTA'!$D$6:$D$21:'CETAK NOTA'!$D$1730:$D$1746,E291,'CETAK NOTA'!$B$6:$B$21:'CETAK NOTA'!$B$1730:$B$1746,B291)","v":0},null,{"$f":"SUMIFS('CETAK NOTA'!$C$6:$C$21:'CETAK NOTA'!$C$1730:$C$1746,'CETAK NOTA'!$D$6:$D$21:'CETAK NOTA'!$D$1730:$D$1746,G291,'CETAK NOTA'!$B$6:$B$21:'CETAK NOTA'!$B$1730:$B$1746,B291)","v":0}]
[null,null,"",{"$f":"SUMIFS('CETAK NOTA'!$C$6:$C$21:'CETAK NOTA'!$C$1730:$C$1746,'CETAK NOTA'!$D$6:$D$21:'CETAK NOTA'!$D$1730:$D$1746,E292,'CETAK NOTA'!$B$6:$B$21:'CETAK NOTA'!$B$1730:$B$1746,B292)","v":0},null,{"$f":"SUMIFS('CETAK NOTA'!$C$6:$C$21:'CETAK NOTA'!$C$1730:$C$1746,'CETAK NOTA'!$D$6:$D$21:'CETAK NOTA'!$D$1730:$D$1746,G292,'CETAK NOTA'!$B$6:$B$21:'CETAK NOTA'!$B$1730:$B$1746,B292)","v":0}]
[null,null,"",{"$f":"SUMIFS('CETAK NOTA'!$C$6:$C$21:'CETAK NOTA'!$C$1730:$C$1746,'CETAK NOTA'!$D$6:$D$21:'CETAK NOTA'!$D$1730:$D$1746,E293,'CETAK NOTA'!$B$6:$B$21:'CETAK NOTA'!$B$1730:$B$1746,B293)","v":0},null,{"$f":"SUMIFS('CETAK NOTA'!$C$6:$C$21:'CETAK NOTA'!$C$1730:$C$1746,'CETAK NOTA'!$D$6:$D$21:'CETAK NOTA'!$D$1730:$D$1746,G293,'CETAK NOTA'!$B$6:$B$21:'CETAK NOTA'!$B$1730:$B$1746,B293)","v":0}]
[null,null,"",{"$f":"SUMIFS('CETAK NOTA'!$C$6:$C$21:'CETAK NOTA'!$C$1730:$C$1746,'CETAK NOTA'!$D$6:$D$21:'CETAK NOTA'!$D$1730:$D$1746,E294,'CETAK NOTA'!$B$6:$B$21:'CETAK NOTA'!$B$1730:$B$1746,B294)","v":0},null,{"$f":"SUMIFS('CETAK NOTA'!$C$6:$C$21:'CETAK NOTA'!$C$1730:$C$1746,'CETAK NOTA'!$D$6:$D$21:'CETAK NOTA'!$D$1730:$D$1746,G294,'CETAK NOTA'!$B$6:$B$21:'CETAK NOTA'!$B$1730:$B$1746,B294)","v":0}]
[null,null,"",{"$f":"SUMIFS('CETAK NOTA'!$C$6:$C$21:'CETAK NOTA'!$C$1730:$C$1746,'CETAK NOTA'!$D$6:$D$21:'CETAK NOTA'!$D$1730:$D$1746,E295,'CETAK NOTA'!$B$6:$B$21:'CETAK NOTA'!$B$1730:$B$1746,B295)","v":0},null,{"$f":"SUMIFS('CETAK NOTA'!$C$6:$C$21:'CETAK NOTA'!$C$1730:$C$1746,'CETAK NOTA'!$D$6:$D$21:'CETAK NOTA'!$D$1730:$D$1746,G295,'CETAK NOTA'!$B$6:$B$21:'CETAK NOTA'!$B$1730:$B$1746,B295)","v":0}]
[null,null,"",{"$f":"SUMIFS('CETAK NOTA'!$C$6:$C$21:'CETAK NOTA'!$C$1730:$C$1746,'CETAK NOTA'!$D$6:$D$21:'CETAK NOTA'!$D$1730:$D$1746,E296,'CETAK NOTA'!$B$6:$B$21:'CETAK NOTA'!$B$1730:$B$1746,B296)","v":0},null,{"$f":"SUMIFS('CETAK NOTA'!$C$6:$C$21:'CETAK NOTA'!$C$1730:$C$1746,'CETAK NOTA'!$D$6:$D$21:'CETAK NOTA'!$D$1730:$D$1746,G296,'CETAK NOTA'!$B$6:$B$21:'CETAK NOTA'!$B$1730:$B$1746,B296)","v":0}]
[null,null,"",{"$f":"SUMIFS('CETAK NOTA'!$C$6:$C$21:'CETAK NOTA'!$C$1730:$C$1746,'CETAK NOTA'!$D$6:$D$21:'CETAK NOTA'!$D$1730:$D$1746,E297,'CETAK NOTA'!$B$6:$B$21:'CETAK NOTA'!$B$1730:$B$1746,B297)","v":0},null,{"$f":"SUMIFS('CETAK NOTA'!$C$6:$C$21:'CETAK NOTA'!$C$1730:$C$1746,'CETAK NOTA'!$D$6:$D$21:'CETAK NOTA'!$D$1730:$D$1746,G297,'CETAK NOTA'!$B$6:$B$21:'CETAK NOTA'!$B$1730:$B$1746,B297)","v":0}]
[null,null,"",{"$f":"SUMIFS('CETAK NOTA'!$C$6:$C$21:'CETAK NOTA'!$C$1730:$C$1746,'CETAK NOTA'!$D$6:$D$21:'CETAK NOTA'!$D$1730:$D$1746,E298,'CETAK NOTA'!$B$6:$B$21:'CETAK NOTA'!$B$1730:$B$1746,B298)","v":0},null,{"$f":"SUMIFS('CETAK NOTA'!$C$6:$C$21:'CETAK NOTA'!$C$1730:$C$1746,'CETAK NOTA'!$D$6:$D$21:'CETAK NOTA'!$D$1730:$D$1746,G298,'CETAK NOTA'!$B$6:$B$21:'CETAK NOTA'!$B$1730:$B$1746,B298)","v":0}]
[null,null,"",{"$f":"SUMIFS('CETAK NOTA'!$C$6:$C$21:'CETAK NOTA'!$C$1730:$C$1746,'CETAK NOTA'!$D$6:$D$21:'CETAK NOTA'!$D$1730:$D$1746,E299,'CETAK NOTA'!$B$6:$B$21:'CETAK NOTA'!$B$1730:$B$1746,B299)","v":0},null,{"$f":"SUMIFS('CETAK NOTA'!$C$6:$C$21:'CETAK NOTA'!$C$1730:$C$1746,'CETAK NOTA'!$D$6:$D$21:'CETAK NOTA'!$D$1730:$D$1746,G299,'CETAK NOTA'!$B$6:$B$21:'CETAK NOTA'!$B$1730:$B$1746,B299)","v":0}]
[null,null,"",{"$f":"SUMIFS('CETAK NOTA'!$C$6:$C$21:'CETAK NOTA'!$C$1730:$C$1746,'CETAK NOTA'!$D$6:$D$21:'CETAK NOTA'!$D$1730:$D$1746,E300,'CETAK NOTA'!$B$6:$B$21:'CETAK NOTA'!$B$1730:$B$1746,B300)","v":0},null,{"$f":"SUMIFS('CETAK NOTA'!$C$6:$C$21:'CETAK NOTA'!$C$1730:$C$1746,'CETAK NOTA'!$D$6:$D$21:'CETAK NOTA'!$D$1730:$D$1746,G300,'CETAK NOTA'!$B$6:$B$21:'CETAK NOTA'!$B$1730:$B$1746,B300)","v":0}]
[null,null,"",{"$f":"SUMIFS('CETAK NOTA'!$C$6:$C$21:'CETAK NOTA'!$C$1730:$C$1746,'CETAK NOTA'!$D$6:$D$21:'CETAK NOTA'!$D$1730:$D$1746,E301,'CETAK NOTA'!$B$6:$B$21:'CETAK NOTA'!$B$1730:$B$1746,B301)","v":0},null,{"$f":"SUMIFS('CETAK NOTA'!$C$6:$C$21:'CETAK NOTA'!$C$1730:$C$1746,'CETAK NOTA'!$D$6:$D$21:'CETAK NOTA'!$D$1730:$D$1746,G301,'CETAK NOTA'!$B$6:$B$21:'CETAK NOTA'!$B$1730:$B$1746,B301)","v":0}]
[null,null,"",{"$f":"SUMIFS('CETAK NOTA'!$C$6:$C$21:'CETAK NOTA'!$C$1730:$C$1746,'CETAK NOTA'!$D$6:$D$21:'CETAK NOTA'!$D$1730:$D$1746,E302,'CETAK NOTA'!$B$6:$B$21:'CETAK NOTA'!$B$1730:$B$1746,B302)","v":0},null,{"$f":"SUMIFS('CETAK NOTA'!$C$6:$C$21:'CETAK NOTA'!$C$1730:$C$1746,'CETAK NOTA'!$D$6:$D$21:'CETAK NOTA'!$D$1730:$D$1746,G302,'CETAK NOTA'!$B$6:$B$21:'CETAK NOTA'!$B$1730:$B$1746,B302)","v":0}]
[null,null,"",{"$f":"SUMIFS('CETAK NOTA'!$C$6:$C$21:'CETAK NOTA'!$C$1730:$C$1746,'CETAK NOTA'!$D$6:$D$21:'CETAK NOTA'!$D$1730:$D$1746,E303,'CETAK NOTA'!$B$6:$B$21:'CETAK NOTA'!$B$1730:$B$1746,B303)","v":0},null,{"$f":"SUMIFS('CETAK NOTA'!$C$6:$C$21:'CETAK NOTA'!$C$1730:$C$1746,'CETAK NOTA'!$D$6:$D$21:'CETAK NOTA'!$D$1730:$D$1746,G303,'CETAK NOTA'!$B$6:$B$21:'CETAK NOTA'!$B$1730:$B$1746,B303)","v":0}]
[null,null,"",{"$f":"SUMIFS('CETAK NOTA'!$C$6:$C$21:'CETAK NOTA'!$C$1730:$C$1746,'CETAK NOTA'!$D$6:$D$21:'CETAK NOTA'!$D$1730:$D$1746,E304,'CETAK NOTA'!$B$6:$B$21:'CETAK NOTA'!$B$1730:$B$1746,B304)","v":0},null,{"$f":"SUMIFS('CETAK NOTA'!$C$6:$C$21:'CETAK NOTA'!$C$1730:$C$1746,'CETAK NOTA'!$D$6:$D$21:'CETAK NOTA'!$D$1730:$D$1746,G304,'CETAK NOTA'!$B$6:$B$21:'CETAK NOTA'!$B$1730:$B$1746,B304)","v":0}]
[null,null,"",{"$f":"SUMIFS('CETAK NOTA'!$C$6:$C$21:'CETAK NOTA'!$C$1730:$C$1746,'CETAK NOTA'!$D$6:$D$21:'CETAK NOTA'!$D$1730:$D$1746,E305,'CETAK NOTA'!$B$6:$B$21:'CETAK NOTA'!$B$1730:$B$1746,B305)","v":0},null,{"$f":"SUMIFS('CETAK NOTA'!$C$6:$C$21:'CETAK NOTA'!$C$1730:$C$1746,'CETAK NOTA'!$D$6:$D$21:'CETAK NOTA'!$D$1730:$D$1746,G305,'CETAK NOTA'!$B$6:$B$21:'CETAK NOTA'!$B$1730:$B$1746,B305)","v":0}]
[null,null,"",{"$f":"SUMIFS('CETAK NOTA'!$C$6:$C$21:'CETAK NOTA'!$C$1730:$C$1746,'CETAK NOTA'!$D$6:$D$21:'CETAK NOTA'!$D$1730:$D$1746,E306,'CETAK NOTA'!$B$6:$B$21:'CETAK NOTA'!$B$1730:$B$1746,B306)","v":0},null,{"$f":"SUMIFS('CETAK NOTA'!$C$6:$C$21:'CETAK NOTA'!$C$1730:$C$1746,'CETAK NOTA'!$D$6:$D$21:'CETAK NOTA'!$D$1730:$D$1746,G306,'CETAK NOTA'!$B$6:$B$21:'CETAK NOTA'!$B$1730:$B$1746,B306)","v":0}]
[null,null,"",{"$f":"SUMIFS('CETAK NOTA'!$C$6:$C$21:'CETAK NOTA'!$C$1730:$C$1746,'CETAK NOTA'!$D$6:$D$21:'CETAK NOTA'!$D$1730:$D$1746,E307,'CETAK NOTA'!$B$6:$B$21:'CETAK NOTA'!$B$1730:$B$1746,B307)","v":0},null,{"$f":"SUMIFS('CETAK NOTA'!$C$6:$C$21:'CETAK NOTA'!$C$1730:$C$1746,'CETAK NOTA'!$D$6:$D$21:'CETAK NOTA'!$D$1730:$D$1746,G307,'CETAK NOTA'!$B$6:$B$21:'CETAK NOTA'!$B$1730:$B$1746,B307)","v":0}]
[null,null,"",{"$f":"SUMIFS('CETAK NOTA'!$C$6:$C$21:'CETAK NOTA'!$C$1730:$C$1746,'CETAK NOTA'!$D$6:$D$21:'CETAK NOTA'!$D$1730:$D$1746,E308,'CETAK NOTA'!$B$6:$B$21:'CETAK NOTA'!$B$1730:$B$1746,B308)","v":0},null,{"$f":"SUMIFS('CETAK NOTA'!$C$6:$C$21:'CETAK NOTA'!$C$1730:$C$1746,'CETAK NOTA'!$D$6:$D$21:'CETAK NOTA'!$D$1730:$D$1746,G308,'CETAK NOTA'!$B$6:$B$21:'CETAK NOTA'!$B$1730:$B$1746,B308)","v":0}]
[null,null,"",{"$f":"SUMIFS('CETAK NOTA'!$C$6:$C$21:'CETAK NOTA'!$C$1730:$C$1746,'CETAK NOTA'!$D$6:$D$21:'CETAK NOTA'!$D$1730:$D$1746,E309,'CETAK NOTA'!$B$6:$B$21:'CETAK NOTA'!$B$1730:$B$1746,B309)","v":0},null,{"$f":"SUMIFS('CETAK NOTA'!$C$6:$C$21:'CETAK NOTA'!$C$1730:$C$1746,'CETAK NOTA'!$D$6:$D$21:'CETAK NOTA'!$D$1730:$D$1746,G309,'CETAK NOTA'!$B$6:$B$21:'CETAK NOTA'!$B$1730:$B$1746,B309)","v":0}]
[null,null,"",{"$f":"SUMIFS('CETAK NOTA'!$C$6:$C$21:'CETAK NOTA'!$C$1730:$C$1746,'CETAK NOTA'!$D$6:$D$21:'CETAK NOTA'!$D$1730:$D$1746,E310,'CETAK NOTA'!$B$6:$B$21:'CETAK NOTA'!$B$1730:$B$1746,B310)","v":0},null,{"$f":"SUMIFS('CETAK NOTA'!$C$6:$C$21:'CETAK NOTA'!$C$1730:$C$1746,'CETAK NOTA'!$D$6:$D$21:'CETAK NOTA'!$D$1730:$D$1746,G310,'CETAK NOTA'!$B$6:$B$21:'CETAK NOTA'!$B$1730:$B$1746,B310)","v":0}]
[null,null,"",{"$f":"SUMIFS('CETAK NOTA'!$C$6:$C$21:'CETAK NOTA'!$C$1730:$C$1746,'CETAK NOTA'!$D$6:$D$21:'CETAK NOTA'!$D$1730:$D$1746,E311,'CETAK NOTA'!$B$6:$B$21:'CETAK NOTA'!$B$1730:$B$1746,B311)","v":0},null,{"$f":"SUMIFS('CETAK NOTA'!$C$6:$C$21:'CETAK NOTA'!$C$1730:$C$1746,'CETAK NOTA'!$D$6:$D$21:'CETAK NOTA'!$D$1730:$D$1746,G311,'CETAK NOTA'!$B$6:$B$21:'CETAK NOTA'!$B$1730:$B$1746,B311)","v":0}]
[null,null,"",{"$f":"SUMIFS('CETAK NOTA'!$C$6:$C$21:'CETAK NOTA'!$C$1730:$C$1746,'CETAK NOTA'!$D$6:$D$21:'CETAK NOTA'!$D$1730:$D$1746,E312,'CETAK NOTA'!$B$6:$B$21:'CETAK NOTA'!$B$1730:$B$1746,B312)","v":0},null,{"$f":"SUMIFS('CETAK NOTA'!$C$6:$C$21:'CETAK NOTA'!$C$1730:$C$1746,'CETAK NOTA'!$D$6:$D$21:'CETAK NOTA'!$D$1730:$D$1746,G312,'CETAK NOTA'!$B$6:$B$21:'CETAK NOTA'!$B$1730:$B$1746,B312)","v":0}]
[null,null,"",{"$f":"SUMIFS('CETAK NOTA'!$C$6:$C$21:'CETAK NOTA'!$C$1730:$C$1746,'CETAK NOTA'!$D$6:$D$21:'CETAK NOTA'!$D$1730:$D$1746,E313,'CETAK NOTA'!$B$6:$B$21:'CETAK NOTA'!$B$1730:$B$1746,B313)","v":0},null,{"$f":"SUMIFS('CETAK NOTA'!$C$6:$C$21:'CETAK NOTA'!$C$1730:$C$1746,'CETAK NOTA'!$D$6:$D$21:'CETAK NOTA'!$D$1730:$D$1746,G313,'CETAK NOTA'!$B$6:$B$21:'CETAK NOTA'!$B$1730:$B$1746,B313)","v":0}]
[null,null,"",{"$f":"SUMIFS('CETAK NOTA'!$C$6:$C$21:'CETAK NOTA'!$C$1730:$C$1746,'CETAK NOTA'!$D$6:$D$21:'CETAK NOTA'!$D$1730:$D$1746,E314,'CETAK NOTA'!$B$6:$B$21:'CETAK NOTA'!$B$1730:$B$1746,B314)","v":0},null,{"$f":"SUMIFS('CETAK NOTA'!$C$6:$C$21:'CETAK NOTA'!$C$1730:$C$1746,'CETAK NOTA'!$D$6:$D$21:'CETAK NOTA'!$D$1730:$D$1746,G314,'CETAK NOTA'!$B$6:$B$21:'CETAK NOTA'!$B$1730:$B$1746,B314)","v":0}]
[null,null,"",{"$f":"SUMIFS('CETAK NOTA'!$C$6:$C$21:'CETAK NOTA'!$C$1730:$C$1746,'CETAK NOTA'!$D$6:$D$21:'CETAK NOTA'!$D$1730:$D$1746,E315,'CETAK NOTA'!$B$6:$B$21:'CETAK NOTA'!$B$1730:$B$1746,B315)","v":0},null,{"$f":"SUMIFS('CETAK NOTA'!$C$6:$C$21:'CETAK NOTA'!$C$1730:$C$1746,'CETAK NOTA'!$D$6:$D$21:'CETAK NOTA'!$D$1730:$D$1746,G315,'CETAK NOTA'!$B$6:$B$21:'CETAK NOTA'!$B$1730:$B$1746,B315)","v":0}]
[null,null,"",{"$f":"SUMIFS('CETAK NOTA'!$C$6:$C$21:'CETAK NOTA'!$C$1730:$C$1746,'CETAK NOTA'!$D$6:$D$21:'CETAK NOTA'!$D$1730:$D$1746,E316,'CETAK NOTA'!$B$6:$B$21:'CETAK NOTA'!$B$1730:$B$1746,B316)","v":0},null,{"$f":"SUMIFS('CETAK NOTA'!$C$6:$C$21:'CETAK NOTA'!$C$1730:$C$1746,'CETAK NOTA'!$D$6:$D$21:'CETAK NOTA'!$D$1730:$D$1746,G316,'CETAK NOTA'!$B$6:$B$21:'CETAK NOTA'!$B$1730:$B$1746,B316)","v":0}]
[null,null,"",{"$f":"SUMIFS('CETAK NOTA'!$C$6:$C$21:'CETAK NOTA'!$C$1730:$C$1746,'CETAK NOTA'!$D$6:$D$21:'CETAK NOTA'!$D$1730:$D$1746,E317,'CETAK NOTA'!$B$6:$B$21:'CETAK NOTA'!$B$1730:$B$1746,B317)","v":0},null,{"$f":"SUMIFS('CETAK NOTA'!$C$6:$C$21:'CETAK NOTA'!$C$1730:$C$1746,'CETAK NOTA'!$D$6:$D$21:'CETAK NOTA'!$D$1730:$D$1746,G317,'CETAK NOTA'!$B$6:$B$21:'CETAK NOTA'!$B$1730:$B$1746,B317)","v":0}]
[null,null,"",{"$f":"SUMIFS('CETAK NOTA'!$C$6:$C$21:'CETAK NOTA'!$C$1730:$C$1746,'CETAK NOTA'!$D$6:$D$21:'CETAK NOTA'!$D$1730:$D$1746,E318,'CETAK NOTA'!$B$6:$B$21:'CETAK NOTA'!$B$1730:$B$1746,B318)","v":0},null,{"$f":"SUMIFS('CETAK NOTA'!$C$6:$C$21:'CETAK NOTA'!$C$1730:$C$1746,'CETAK NOTA'!$D$6:$D$21:'CETAK NOTA'!$D$1730:$D$1746,G318,'CETAK NOTA'!$B$6:$B$21:'CETAK NOTA'!$B$1730:$B$1746,B318)","v":0}]
[null,null,"",{"$f":"SUMIFS('CETAK NOTA'!$C$6:$C$21:'CETAK NOTA'!$C$1730:$C$1746,'CETAK NOTA'!$D$6:$D$21:'CETAK NOTA'!$D$1730:$D$1746,E319,'CETAK NOTA'!$B$6:$B$21:'CETAK NOTA'!$B$1730:$B$1746,B319)","v":0},null,{"$f":"SUMIFS('CETAK NOTA'!$C$6:$C$21:'CETAK NOTA'!$C$1730:$C$1746,'CETAK NOTA'!$D$6:$D$21:'CETAK NOTA'!$D$1730:$D$1746,G319,'CETAK NOTA'!$B$6:$B$21:'CETAK NOTA'!$B$1730:$B$1746,B319)","v":0}]
[null,null,"",{"$f":"SUMIFS('CETAK NOTA'!$C$6:$C$21:'CETAK NOTA'!$C$1730:$C$1746,'CETAK NOTA'!$D$6:$D$21:'CETAK NOTA'!$D$1730:$D$1746,E320,'CETAK NOTA'!$B$6:$B$21:'CETAK NOTA'!$B$1730:$B$1746,B320)","v":0},null,{"$f":"SUMIFS('CETAK NOTA'!$C$6:$C$21:'CETAK NOTA'!$C$1730:$C$1746,'CETAK NOTA'!$D$6:$D$21:'CETAK NOTA'!$D$1730:$D$1746,G320,'CETAK NOTA'!$B$6:$B$21:'CETAK NOTA'!$B$1730:$B$1746,B320)","v":0}]
[null,null,"",{"$f":"SUMIFS('CETAK NOTA'!$C$6:$C$21:'CETAK NOTA'!$C$1730:$C$1746,'CETAK NOTA'!$D$6:$D$21:'CETAK NOTA'!$D$1730:$D$1746,E321,'CETAK NOTA'!$B$6:$B$21:'CETAK NOTA'!$B$1730:$B$1746,B321)","v":0},null,{"$f":"SUMIFS('CETAK NOTA'!$C$6:$C$21:'CETAK NOTA'!$C$1730:$C$1746,'CETAK NOTA'!$D$6:$D$21:'CETAK NOTA'!$D$1730:$D$1746,G321,'CETAK NOTA'!$B$6:$B$21:'CETAK NOTA'!$B$1730:$B$1746,B321)","v":0}]
[null,null,{"$f":"IF(AND(K322=0,L322=0),\"\",IF(AND(D322>0,K322>L322),\"RM\",\"TK\"))","v":""},{"$f":"SUMIFS('CETAK NOTA'!$C$6:$C$21:'CETAK NOTA'!$C$1730:$C$1746,'CETAK NOTA'!$D$6:$D$21:'CETAK NOTA'!$D$1730:$D$1746,E322,'CETAK NOTA'!$B$6:$B$21:'CETAK NOTA'!$B$1730:$B$1746,B322)","v":0},null,{"$f":"SUMIFS('CETAK NOTA'!$C$6:$C$21:'CETAK NOTA'!$C$1730:$C$1746,'CETAK NOTA'!$D$6:$D$21:'CETAK NOTA'!$D$1730:$D$1746,G322,'CETAK NOTA'!$B$6:$B$21:'CETAK NOTA'!$B$1730:$B$1746,B322)","v":0}]
[null,null,"",{"$f":"SUMIFS('CETAK NOTA'!$C$6:$C$21:'CETAK NOTA'!$C$1730:$C$1746,'CETAK NOTA'!$D$6:$D$21:'CETAK NOTA'!$D$1730:$D$1746,E323,'CETAK NOTA'!$B$6:$B$21:'CETAK NOTA'!$B$1730:$B$1746,B323)","v":0},null,{"$f":"SUMIFS('CETAK NOTA'!$C$6:$C$21:'CETAK NOTA'!$C$1730:$C$1746,'CETAK NOTA'!$D$6:$D$21:'CETAK NOTA'!$D$1730:$D$1746,G323,'CETAK NOTA'!$B$6:$B$21:'CETAK NOTA'!$B$1730:$B$1746,B323)","v":0}]
[null,null,"",{"$f":"SUMIFS('CETAK NOTA'!$C$6:$C$21:'CETAK NOTA'!$C$1730:$C$1746,'CETAK NOTA'!$D$6:$D$21:'CETAK NOTA'!$D$1730:$D$1746,E324,'CETAK NOTA'!$B$6:$B$21:'CETAK NOTA'!$B$1730:$B$1746,B324)","v":0},null,{"$f":"SUMIFS('CETAK NOTA'!$C$6:$C$21:'CETAK NOTA'!$C$1730:$C$1746,'CETAK NOTA'!$D$6:$D$21:'CETAK NOTA'!$D$1730:$D$1746,G324,'CETAK NOTA'!$B$6:$B$21:'CETAK NOTA'!$B$1730:$B$1746,B324)","v":0}]
[null,null,"",{"$f":"SUMIFS('CETAK NOTA'!$C$6:$C$21:'CETAK NOTA'!$C$1730:$C$1746,'CETAK NOTA'!$D$6:$D$21:'CETAK NOTA'!$D$1730:$D$1746,E325,'CETAK NOTA'!$B$6:$B$21:'CETAK NOTA'!$B$1730:$B$1746,B325)","v":0},null,{"$f":"SUMIFS('CETAK NOTA'!$C$6:$C$21:'CETAK NOTA'!$C$1730:$C$1746,'CETAK NOTA'!$D$6:$D$21:'CETAK NOTA'!$D$1730:$D$1746,G325,'CETAK NOTA'!$B$6:$B$21:'CETAK NOTA'!$B$1730:$B$1746,B325)","v":0}]
[null,null,"",{"$f":"SUMIFS('CETAK NOTA'!$C$6:$C$21:'CETAK NOTA'!$C$1730:$C$1746,'CETAK NOTA'!$D$6:$D$21:'CETAK NOTA'!$D$1730:$D$1746,E326,'CETAK NOTA'!$B$6:$B$21:'CETAK NOTA'!$B$1730:$B$1746,B326)","v":0},null,{"$f":"SUMIFS('CETAK NOTA'!$C$6:$C$21:'CETAK NOTA'!$C$1730:$C$1746,'CETAK NOTA'!$D$6:$D$21:'CETAK NOTA'!$D$1730:$D$1746,G326,'CETAK NOTA'!$B$6:$B$21:'CETAK NOTA'!$B$1730:$B$1746,B326)","v":0}]
[null,null,"",{"$f":"SUMIFS('CETAK NOTA'!$C$6:$C$21:'CETAK NOTA'!$C$1730:$C$1746,'CETAK NOTA'!$D$6:$D$21:'CETAK NOTA'!$D$1730:$D$1746,E327,'CETAK NOTA'!$B$6:$B$21:'CETAK NOTA'!$B$1730:$B$1746,B327)","v":0},null,{"$f":"SUMIFS('CETAK NOTA'!$C$6:$C$21:'CETAK NOTA'!$C$1730:$C$1746,'CETAK NOTA'!$D$6:$D$21:'CETAK NOTA'!$D$1730:$D$1746,G327,'CETAK NOTA'!$B$6:$B$21:'CETAK NOTA'!$B$1730:$B$1746,B327)","v":0}]
[null,null,"",{"$f":"SUMIFS('CETAK NOTA'!$C$6:$C$21:'CETAK NOTA'!$C$1730:$C$1746,'CETAK NOTA'!$D$6:$D$21:'CETAK NOTA'!$D$1730:$D$1746,E328,'CETAK NOTA'!$B$6:$B$21:'CETAK NOTA'!$B$1730:$B$1746,B328)","v":0},null,{"$f":"SUMIFS('CETAK NOTA'!$C$6:$C$21:'CETAK NOTA'!$C$1730:$C$1746,'CETAK NOTA'!$D$6:$D$21:'CETAK NOTA'!$D$1730:$D$1746,G328,'CETAK NOTA'!$B$6:$B$21:'CETAK NOTA'!$B$1730:$B$1746,B328)","v":0}]
[null,null,"",{"$f":"SUMIFS('CETAK NOTA'!$C$6:$C$21:'CETAK NOTA'!$C$1730:$C$1746,'CETAK NOTA'!$D$6:$D$21:'CETAK NOTA'!$D$1730:$D$1746,E329,'CETAK NOTA'!$B$6:$B$21:'CETAK NOTA'!$B$1730:$B$1746,B329)","v":0},null,{"$f":"SUMIFS('CETAK NOTA'!$C$6:$C$21:'CETAK NOTA'!$C$1730:$C$1746,'CETAK NOTA'!$D$6:$D$21:'CETAK NOTA'!$D$1730:$D$1746,G329,'CETAK NOTA'!$B$6:$B$21:'CETAK NOTA'!$B$1730:$B$1746,B329)","v":0}]
[null,null,"",{"$f":"SUMIFS('CETAK NOTA'!$C$6:$C$21:'CETAK NOTA'!$C$1730:$C$1746,'CETAK NOTA'!$D$6:$D$21:'CETAK NOTA'!$D$1730:$D$1746,E330,'CETAK NOTA'!$B$6:$B$21:'CETAK NOTA'!$B$1730:$B$1746,B330)","v":0},null,{"$f":"SUMIFS('CETAK NOTA'!$C$6:$C$21:'CETAK NOTA'!$C$1730:$C$1746,'CETAK NOTA'!$D$6:$D$21:'CETAK NOTA'!$D$1730:$D$1746,G330,'CETAK NOTA'!$B$6:$B$21:'CETAK NOTA'!$B$1730:$B$1746,B330)","v":0}]
[null,null,"",{"$f":"SUMIFS('CETAK NOTA'!$C$6:$C$21:'CETAK NOTA'!$C$1730:$C$1746,'CETAK NOTA'!$D$6:$D$21:'CETAK NOTA'!$D$1730:$D$1746,E331,'CETAK NOTA'!$B$6:$B$21:'CETAK NOTA'!$B$1730:$B$1746,B331)","v":0},null,{"$f":"SUMIFS('CETAK NOTA'!$C$6:$C$21:'CETAK NOTA'!$C$1730:$C$1746,'CETAK NOTA'!$D$6:$D$21:'CETAK NOTA'!$D$1730:$D$1746,G331,'CETAK NOTA'!$B$6:$B$21:'CETAK NOTA'!$B$1730:$B$1746,B331)","v":0}]
[null,null,"",{"$f":"SUMIFS('CETAK NOTA'!$C$6:$C$21:'CETAK NOTA'!$C$1730:$C$1746,'CETAK NOTA'!$D$6:$D$21:'CETAK NOTA'!$D$1730:$D$1746,E332,'CETAK NOTA'!$B$6:$B$21:'CETAK NOTA'!$B$1730:$B$1746,B332)","v":0},null,{"$f":"SUMIFS('CETAK NOTA'!$C$6:$C$21:'CETAK NOTA'!$C$1730:$C$1746,'CETAK NOTA'!$D$6:$D$21:'CETAK NOTA'!$D$1730:$D$1746,G332,'CETAK NOTA'!$B$6:$B$21:'CETAK NOTA'!$B$1730:$B$1746,B332)","v":0}]
[null,null,"",{"$f":"SUMIFS('CETAK NOTA'!$C$6:$C$21:'CETAK NOTA'!$C$1730:$C$1746,'CETAK NOTA'!$D$6:$D$21:'CETAK NOTA'!$D$1730:$D$1746,E333,'CETAK NOTA'!$B$6:$B$21:'CETAK NOTA'!$B$1730:$B$1746,B333)","v":0},null,{"$f":"SUMIFS('CETAK NOTA'!$C$6:$C$21:'CETAK NOTA'!$C$1730:$C$1746,'CETAK NOTA'!$D$6:$D$21:'CETAK NOTA'!$D$1730:$D$1746,G333,'CETAK NOTA'!$B$6:$B$21:'CETAK NOTA'!$B$1730:$B$1746,B333)","v":0}]
[null,null,"",{"$f":"SUMIFS('CETAK NOTA'!$C$6:$C$21:'CETAK NOTA'!$C$1730:$C$1746,'CETAK NOTA'!$D$6:$D$21:'CETAK NOTA'!$D$1730:$D$1746,E334,'CETAK NOTA'!$B$6:$B$21:'CETAK NOTA'!$B$1730:$B$1746,B334)","v":0},null,{"$f":"SUMIFS('CETAK NOTA'!$C$6:$C$21:'CETAK NOTA'!$C$1730:$C$1746,'CETAK NOTA'!$D$6:$D$21:'CETAK NOTA'!$D$1730:$D$1746,G334,'CETAK NOTA'!$B$6:$B$21:'CETAK NOTA'!$B$1730:$B$1746,B334)","v":0}]
[null,null,"",{"$f":"SUMIFS('CETAK NOTA'!$C$6:$C$21:'CETAK NOTA'!$C$1730:$C$1746,'CETAK NOTA'!$D$6:$D$21:'CETAK NOTA'!$D$1730:$D$1746,E335,'CETAK NOTA'!$B$6:$B$21:'CETAK NOTA'!$B$1730:$B$1746,B335)","v":0},null,{"$f":"SUMIFS('CETAK NOTA'!$C$6:$C$21:'CETAK NOTA'!$C$1730:$C$1746,'CETAK NOTA'!$D$6:$D$21:'CETAK NOTA'!$D$1730:$D$1746,G335,'CETAK NOTA'!$B$6:$B$21:'CETAK NOTA'!$B$1730:$B$1746,B335)","v":0}]
[null,null,"",{"$f":"SUMIFS('CETAK NOTA'!$C$6:$C$21:'CETAK NOTA'!$C$1730:$C$1746,'CETAK NOTA'!$D$6:$D$21:'CETAK NOTA'!$D$1730:$D$1746,E336,'CETAK NOTA'!$B$6:$B$21:'CETAK NOTA'!$B$1730:$B$1746,B336)","v":0},null,{"$f":"SUMIFS('CETAK NOTA'!$C$6:$C$21:'CETAK NOTA'!$C$1730:$C$1746,'CETAK NOTA'!$D$6:$D$21:'CETAK NOTA'!$D$1730:$D$1746,G336,'CETAK NOTA'!$B$6:$B$21:'CETAK NOTA'!$B$1730:$B$1746,B336)","v":0}]
[null,null,"",{"$f":"SUMIFS('CETAK NOTA'!$C$6:$C$21:'CETAK NOTA'!$C$1730:$C$1746,'CETAK NOTA'!$D$6:$D$21:'CETAK NOTA'!$D$1730:$D$1746,E337,'CETAK NOTA'!$B$6:$B$21:'CETAK NOTA'!$B$1730:$B$1746,B337)","v":0},null,{"$f":"SUMIFS('CETAK NOTA'!$C$6:$C$21:'CETAK NOTA'!$C$1730:$C$1746,'CETAK NOTA'!$D$6:$D$21:'CETAK NOTA'!$D$1730:$D$1746,G337,'CETAK NOTA'!$B$6:$B$21:'CETAK NOTA'!$B$1730:$B$1746,B337)","v":0}]
[null,null,"",{"$f":"SUMIFS('CETAK NOTA'!$C$6:$C$21:'CETAK NOTA'!$C$1730:$C$1746,'CETAK NOTA'!$D$6:$D$21:'CETAK NOTA'!$D$1730:$D$1746,E338,'CETAK NOTA'!$B$6:$B$21:'CETAK NOTA'!$B$1730:$B$1746,B338)","v":0},null,{"$f":"SUMIFS('CETAK NOTA'!$C$6:$C$21:'CETAK NOTA'!$C$1730:$C$1746,'CETAK NOTA'!$D$6:$D$21:'CETAK NOTA'!$D$1730:$D$1746,G338,'CETAK NOTA'!$B$6:$B$21:'CETAK NOTA'!$B$1730:$B$1746,B338)","v":0}]
[null,null,"",{"$f":"SUMIFS('CETAK NOTA'!$C$6:$C$21:'CETAK NOTA'!$C$1730:$C$1746,'CETAK NOTA'!$D$6:$D$21:'CETAK NOTA'!$D$1730:$D$1746,E339,'CETAK NOTA'!$B$6:$B$21:'CETAK NOTA'!$B$1730:$B$1746,B339)","v":0},null,{"$f":"SUMIFS('CETAK NOTA'!$C$6:$C$21:'CETAK NOTA'!$C$1730:$C$1746,'CETAK NOTA'!$D$6:$D$21:'CETAK NOTA'!$D$1730:$D$1746,G339,'CETAK NOTA'!$B$6:$B$21:'CETAK NOTA'!$B$1730:$B$1746,B339)","v":0}]
[null,null,"",{"$f":"SUMIFS('CETAK NOTA'!$C$6:$C$21:'CETAK NOTA'!$C$1730:$C$1746,'CETAK NOTA'!$D$6:$D$21:'CETAK NOTA'!$D$1730:$D$1746,E340,'CETAK NOTA'!$B$6:$B$21:'CETAK NOTA'!$B$1730:$B$1746,B340)","v":0},null,{"$f":"SUMIFS('CETAK NOTA'!$C$6:$C$21:'CETAK NOTA'!$C$1730:$C$1746,'CETAK NOTA'!$D$6:$D$21:'CETAK NOTA'!$D$1730:$D$1746,G340,'CETAK NOTA'!$B$6:$B$21:'CETAK NOTA'!$B$1730:$B$1746,B340)","v":0}]
[null,null,"",{"$f":"SUMIFS('CETAK NOTA'!$C$6:$C$21:'CETAK NOTA'!$C$1730:$C$1746,'CETAK NOTA'!$D$6:$D$21:'CETAK NOTA'!$D$1730:$D$1746,E341,'CETAK NOTA'!$B$6:$B$21:'CETAK NOTA'!$B$1730:$B$1746,B341)","v":0},null,{"$f":"SUMIFS('CETAK NOTA'!$C$6:$C$21:'CETAK NOTA'!$C$1730:$C$1746,'CETAK NOTA'!$D$6:$D$21:'CETAK NOTA'!$D$1730:$D$1746,G341,'CETAK NOTA'!$B$6:$B$21:'CETAK NOTA'!$B$1730:$B$1746,B341)","v":0}]
[null,null,"",{"$f":"SUMIFS('CETAK NOTA'!$C$6:$C$21:'CETAK NOTA'!$C$1730:$C$1746,'CETAK NOTA'!$D$6:$D$21:'CETAK NOTA'!$D$1730:$D$1746,E342,'CETAK NOTA'!$B$6:$B$21:'CETAK NOTA'!$B$1730:$B$1746,B342)","v":0},null,{"$f":"SUMIFS('CETAK NOTA'!$C$6:$C$21:'CETAK NOTA'!$C$1730:$C$1746,'CETAK NOTA'!$D$6:$D$21:'CETAK NOTA'!$D$1730:$D$1746,G342,'CETAK NOTA'!$B$6:$B$21:'CETAK NOTA'!$B$1730:$B$1746,B342)","v":0}]
[null,null,"",{"$f":"SUMIFS('CETAK NOTA'!$C$6:$C$21:'CETAK NOTA'!$C$1730:$C$1746,'CETAK NOTA'!$D$6:$D$21:'CETAK NOTA'!$D$1730:$D$1746,E343,'CETAK NOTA'!$B$6:$B$21:'CETAK NOTA'!$B$1730:$B$1746,B343)","v":0},null,{"$f":"SUMIFS('CETAK NOTA'!$C$6:$C$21:'CETAK NOTA'!$C$1730:$C$1746,'CETAK NOTA'!$D$6:$D$21:'CETAK NOTA'!$D$1730:$D$1746,G343,'CETAK NOTA'!$B$6:$B$21:'CETAK NOTA'!$B$1730:$B$1746,B343)","v":0}]
[null,null,"",{"$f":"SUMIFS('CETAK NOTA'!$C$6:$C$21:'CETAK NOTA'!$C$1730:$C$1746,'CETAK NOTA'!$D$6:$D$21:'CETAK NOTA'!$D$1730:$D$1746,E344,'CETAK NOTA'!$B$6:$B$21:'CETAK NOTA'!$B$1730:$B$1746,B344)","v":0},null,{"$f":"SUMIFS('CETAK NOTA'!$C$6:$C$21:'CETAK NOTA'!$C$1730:$C$1746,'CETAK NOTA'!$D$6:$D$21:'CETAK NOTA'!$D$1730:$D$1746,G344,'CETAK NOTA'!$B$6:$B$21:'CETAK NOTA'!$B$1730:$B$1746,B344)","v":0}]
[null,null,"",{"$f":"SUMIFS('CETAK NOTA'!$C$6:$C$21:'CETAK NOTA'!$C$1730:$C$1746,'CETAK NOTA'!$D$6:$D$21:'CETAK NOTA'!$D$1730:$D$1746,E345,'CETAK NOTA'!$B$6:$B$21:'CETAK NOTA'!$B$1730:$B$1746,B345)","v":0},null,{"$f":"SUMIFS('CETAK NOTA'!$C$6:$C$21:'CETAK NOTA'!$C$1730:$C$1746,'CETAK NOTA'!$D$6:$D$21:'CETAK NOTA'!$D$1730:$D$1746,G345,'CETAK NOTA'!$B$6:$B$21:'CETAK NOTA'!$B$1730:$B$1746,B345)","v":0}]
[null,null,"",{"$f":"SUMIFS('CETAK NOTA'!$C$6:$C$21:'CETAK NOTA'!$C$1730:$C$1746,'CETAK NOTA'!$D$6:$D$21:'CETAK NOTA'!$D$1730:$D$1746,E346,'CETAK NOTA'!$B$6:$B$21:'CETAK NOTA'!$B$1730:$B$1746,B346)","v":0},null,{"$f":"SUMIFS('CETAK NOTA'!$C$6:$C$21:'CETAK NOTA'!$C$1730:$C$1746,'CETAK NOTA'!$D$6:$D$21:'CETAK NOTA'!$D$1730:$D$1746,G346,'CETAK NOTA'!$B$6:$B$21:'CETAK NOTA'!$B$1730:$B$1746,B346)","v":0}]
[null,null,"",{"$f":"SUMIFS('CETAK NOTA'!$C$6:$C$21:'CETAK NOTA'!$C$1730:$C$1746,'CETAK NOTA'!$D$6:$D$21:'CETAK NOTA'!$D$1730:$D$1746,E347,'CETAK NOTA'!$B$6:$B$21:'CETAK NOTA'!$B$1730:$B$1746,B347)","v":0},null,{"$f":"SUMIFS('CETAK NOTA'!$C$6:$C$21:'CETAK NOTA'!$C$1730:$C$1746,'CETAK NOTA'!$D$6:$D$21:'CETAK NOTA'!$D$1730:$D$1746,G347,'CETAK NOTA'!$B$6:$B$21:'CETAK NOTA'!$B$1730:$B$1746,B347)","v":0}]
[null,null,"",{"$f":"SUMIFS('CETAK NOTA'!$C$6:$C$21:'CETAK NOTA'!$C$1730:$C$1746,'CETAK NOTA'!$D$6:$D$21:'CETAK NOTA'!$D$1730:$D$1746,E348,'CETAK NOTA'!$B$6:$B$21:'CETAK NOTA'!$B$1730:$B$1746,B348)","v":0},null,{"$f":"SUMIFS('CETAK NOTA'!$C$6:$C$21:'CETAK NOTA'!$C$1730:$C$1746,'CETAK NOTA'!$D$6:$D$21:'CETAK NOTA'!$D$1730:$D$1746,G348,'CETAK NOTA'!$B$6:$B$21:'CETAK NOTA'!$B$1730:$B$1746,B348)","v":0}]
[null,null,"",{"$f":"SUMIFS('CETAK NOTA'!$C$6:$C$21:'CETAK NOTA'!$C$1730:$C$1746,'CETAK NOTA'!$D$6:$D$21:'CETAK NOTA'!$D$1730:$D$1746,E349,'CETAK NOTA'!$B$6:$B$21:'CETAK NOTA'!$B$1730:$B$1746,B349)","v":0},null,{"$f":"SUMIFS('CETAK NOTA'!$C$6:$C$21:'CETAK NOTA'!$C$1730:$C$1746,'CETAK NOTA'!$D$6:$D$21:'CETAK NOTA'!$D$1730:$D$1746,G349,'CETAK NOTA'!$B$6:$B$21:'CETAK NOTA'!$B$1730:$B$1746,B349)","v":0}]
[null,null,"",{"$f":"SUMIFS('CETAK NOTA'!$C$6:$C$21:'CETAK NOTA'!$C$1730:$C$1746,'CETAK NOTA'!$D$6:$D$21:'CETAK NOTA'!$D$1730:$D$1746,E350,'CETAK NOTA'!$B$6:$B$21:'CETAK NOTA'!$B$1730:$B$1746,B350)","v":0},null,{"$f":"SUMIFS('CETAK NOTA'!$C$6:$C$21:'CETAK NOTA'!$C$1730:$C$1746,'CETAK NOTA'!$D$6:$D$21:'CETAK NOTA'!$D$1730:$D$1746,G350,'CETAK NOTA'!$B$6:$B$21:'CETAK NOTA'!$B$1730:$B$1746,B350)","v":0}]
[null,null,"",{"$f":"SUMIFS('CETAK NOTA'!$C$6:$C$21:'CETAK NOTA'!$C$1730:$C$1746,'CETAK NOTA'!$D$6:$D$21:'CETAK NOTA'!$D$1730:$D$1746,E351,'CETAK NOTA'!$B$6:$B$21:'CETAK NOTA'!$B$1730:$B$1746,B351)","v":0},null,{"$f":"SUMIFS('CETAK NOTA'!$C$6:$C$21:'CETAK NOTA'!$C$1730:$C$1746,'CETAK NOTA'!$D$6:$D$21:'CETAK NOTA'!$D$1730:$D$1746,G351,'CETAK NOTA'!$B$6:$B$21:'CETAK NOTA'!$B$1730:$B$1746,B351)","v":0}]
[null,null,"",{"$f":"SUMIFS('CETAK NOTA'!$C$6:$C$21:'CETAK NOTA'!$C$1730:$C$1746,'CETAK NOTA'!$D$6:$D$21:'CETAK NOTA'!$D$1730:$D$1746,E352,'CETAK NOTA'!$B$6:$B$21:'CETAK NOTA'!$B$1730:$B$1746,B352)","v":0},null,{"$f":"SUMIFS('CETAK NOTA'!$C$6:$C$21:'CETAK NOTA'!$C$1730:$C$1746,'CETAK NOTA'!$D$6:$D$21:'CETAK NOTA'!$D$1730:$D$1746,G352,'CETAK NOTA'!$B$6:$B$21:'CETAK NOTA'!$B$1730:$B$1746,B352)","v":0}]
[null,null,"",{"$f":"SUMIFS('CETAK NOTA'!$C$6:$C$21:'CETAK NOTA'!$C$1730:$C$1746,'CETAK NOTA'!$D$6:$D$21:'CETAK NOTA'!$D$1730:$D$1746,E353,'CETAK NOTA'!$B$6:$B$21:'CETAK NOTA'!$B$1730:$B$1746,B353)","v":0},null,{"$f":"SUMIFS('CETAK NOTA'!$C$6:$C$21:'CETAK NOTA'!$C$1730:$C$1746,'CETAK NOTA'!$D$6:$D$21:'CETAK NOTA'!$D$1730:$D$1746,G353,'CETAK NOTA'!$B$6:$B$21:'CETAK NOTA'!$B$1730:$B$1746,B353)","v":0}]
[null,null,"",{"$f":"SUMIFS('CETAK NOTA'!$C$6:$C$21:'CETAK NOTA'!$C$1730:$C$1746,'CETAK NOTA'!$D$6:$D$21:'CETAK NOTA'!$D$1730:$D$1746,E354,'CETAK NOTA'!$B$6:$B$21:'CETAK NOTA'!$B$1730:$B$1746,B354)","v":0},null,{"$f":"SUMIFS('CETAK NOTA'!$C$6:$C$21:'CETAK NOTA'!$C$1730:$C$1746,'CETAK NOTA'!$D$6:$D$21:'CETAK NOTA'!$D$1730:$D$1746,G354,'CETAK NOTA'!$B$6:$B$21:'CETAK NOTA'!$B$1730:$B$1746,B354)","v":0}]
[null,null,"",{"$f":"SUMIFS('CETAK NOTA'!$C$6:$C$21:'CETAK NOTA'!$C$1730:$C$1746,'CETAK NOTA'!$D$6:$D$21:'CETAK NOTA'!$D$1730:$D$1746,E355,'CETAK NOTA'!$B$6:$B$21:'CETAK NOTA'!$B$1730:$B$1746,B355)","v":0},null,{"$f":"SUMIFS('CETAK NOTA'!$C$6:$C$21:'CETAK NOTA'!$C$1730:$C$1746,'CETAK NOTA'!$D$6:$D$21:'CETAK NOTA'!$D$1730:$D$1746,G355,'CETAK NOTA'!$B$6:$B$21:'CETAK NOTA'!$B$1730:$B$1746,B355)","v":0}]
[null,null,"",{"$f":"SUMIFS('CETAK NOTA'!$C$6:$C$21:'CETAK NOTA'!$C$1730:$C$1746,'CETAK NOTA'!$D$6:$D$21:'CETAK NOTA'!$D$1730:$D$1746,E356,'CETAK NOTA'!$B$6:$B$21:'CETAK NOTA'!$B$1730:$B$1746,B356)","v":0},null,{"$f":"SUMIFS('CETAK NOTA'!$C$6:$C$21:'CETAK NOTA'!$C$1730:$C$1746,'CETAK NOTA'!$D$6:$D$21:'CETAK NOTA'!$D$1730:$D$1746,G356,'CETAK NOTA'!$B$6:$B$21:'CETAK NOTA'!$B$1730:$B$1746,B356)","v":0}]
[null,null,"",{"$f":"SUMIFS('CETAK NOTA'!$C$6:$C$21:'CETAK NOTA'!$C$1730:$C$1746,'CETAK NOTA'!$D$6:$D$21:'CETAK NOTA'!$D$1730:$D$1746,E357,'CETAK NOTA'!$B$6:$B$21:'CETAK NOTA'!$B$1730:$B$1746,B357)","v":0},null,{"$f":"SUMIFS('CETAK NOTA'!$C$6:$C$21:'CETAK NOTA'!$C$1730:$C$1746,'CETAK NOTA'!$D$6:$D$21:'CETAK NOTA'!$D$1730:$D$1746,G357,'CETAK NOTA'!$B$6:$B$21:'CETAK NOTA'!$B$1730:$B$1746,B357)","v":0}]
[null,null,"",{"$f":"SUMIFS('CETAK NOTA'!$C$6:$C$21:'CETAK NOTA'!$C$1730:$C$1746,'CETAK NOTA'!$D$6:$D$21:'CETAK NOTA'!$D$1730:$D$1746,E358,'CETAK NOTA'!$B$6:$B$21:'CETAK NOTA'!$B$1730:$B$1746,B358)","v":0},null,{"$f":"SUMIFS('CETAK NOTA'!$C$6:$C$21:'CETAK NOTA'!$C$1730:$C$1746,'CETAK NOTA'!$D$6:$D$21:'CETAK NOTA'!$D$1730:$D$1746,G358,'CETAK NOTA'!$B$6:$B$21:'CETAK NOTA'!$B$1730:$B$1746,B358)","v":0}]
[null,null,"",{"$f":"SUMIFS('CETAK NOTA'!$C$6:$C$21:'CETAK NOTA'!$C$1730:$C$1746,'CETAK NOTA'!$D$6:$D$21:'CETAK NOTA'!$D$1730:$D$1746,E359,'CETAK NOTA'!$B$6:$B$21:'CETAK NOTA'!$B$1730:$B$1746,B359)","v":0},null,{"$f":"SUMIFS('CETAK NOTA'!$C$6:$C$21:'CETAK NOTA'!$C$1730:$C$1746,'CETAK NOTA'!$D$6:$D$21:'CETAK NOTA'!$D$1730:$D$1746,G359,'CETAK NOTA'!$B$6:$B$21:'CETAK NOTA'!$B$1730:$B$1746,B359)","v":0}]
[null,null,"",{"$f":"SUMIFS('CETAK NOTA'!$C$6:$C$21:'CETAK NOTA'!$C$1730:$C$1746,'CETAK NOTA'!$D$6:$D$21:'CETAK NOTA'!$D$1730:$D$1746,E360,'CETAK NOTA'!$B$6:$B$21:'CETAK NOTA'!$B$1730:$B$1746,B360)","v":0},null,{"$f":"SUMIFS('CETAK NOTA'!$C$6:$C$21:'CETAK NOTA'!$C$1730:$C$1746,'CETAK NOTA'!$D$6:$D$21:'CETAK NOTA'!$D$1730:$D$1746,G360,'CETAK NOTA'!$B$6:$B$21:'CETAK NOTA'!$B$1730:$B$1746,B360)","v":0}]
[null,null,"",{"$f":"SUMIFS('CETAK NOTA'!$C$6:$C$21:'CETAK NOTA'!$C$1730:$C$1746,'CETAK NOTA'!$D$6:$D$21:'CETAK NOTA'!$D$1730:$D$1746,E361,'CETAK NOTA'!$B$6:$B$21:'CETAK NOTA'!$B$1730:$B$1746,B361)","v":0},null,{"$f":"SUMIFS('CETAK NOTA'!$C$6:$C$21:'CETAK NOTA'!$C$1730:$C$1746,'CETAK NOTA'!$D$6:$D$21:'CETAK NOTA'!$D$1730:$D$1746,G361,'CETAK NOTA'!$B$6:$B$21:'CETAK NOTA'!$B$1730:$B$1746,B361)","v":0}]
[null,null,"",{"$f":"SUMIFS('CETAK NOTA'!$C$6:$C$21:'CETAK NOTA'!$C$1730:$C$1746,'CETAK NOTA'!$D$6:$D$21:'CETAK NOTA'!$D$1730:$D$1746,E362,'CETAK NOTA'!$B$6:$B$21:'CETAK NOTA'!$B$1730:$B$1746,B362)","v":0},null,{"$f":"SUMIFS('CETAK NOTA'!$C$6:$C$21:'CETAK NOTA'!$C$1730:$C$1746,'CETAK NOTA'!$D$6:$D$21:'CETAK NOTA'!$D$1730:$D$1746,G362,'CETAK NOTA'!$B$6:$B$21:'CETAK NOTA'!$B$1730:$B$1746,B362)","v":0}]
[null,null,"",{"$f":"SUMIFS('CETAK NOTA'!$C$6:$C$21:'CETAK NOTA'!$C$1730:$C$1746,'CETAK NOTA'!$D$6:$D$21:'CETAK NOTA'!$D$1730:$D$1746,E363,'CETAK NOTA'!$B$6:$B$21:'CETAK NOTA'!$B$1730:$B$1746,B363)","v":0},null,{"$f":"SUMIFS('CETAK NOTA'!$C$6:$C$21:'CETAK NOTA'!$C$1730:$C$1746,'CETAK NOTA'!$D$6:$D$21:'CETAK NOTA'!$D$1730:$D$1746,G363,'CETAK NOTA'!$B$6:$B$21:'CETAK NOTA'!$B$1730:$B$1746,B363)","v":0}]
[null,null,"",{"$f":"SUMIFS('CETAK NOTA'!$C$6:$C$21:'CETAK NOTA'!$C$1730:$C$1746,'CETAK NOTA'!$D$6:$D$21:'CETAK NOTA'!$D$1730:$D$1746,E364,'CETAK NOTA'!$B$6:$B$21:'CETAK NOTA'!$B$1730:$B$1746,B364)","v":0},null,{"$f":"SUMIFS('CETAK NOTA'!$C$6:$C$21:'CETAK NOTA'!$C$1730:$C$1746,'CETAK NOTA'!$D$6:$D$21:'CETAK NOTA'!$D$1730:$D$1746,G364,'CETAK NOTA'!$B$6:$B$21:'CETAK NOTA'!$B$1730:$B$1746,B364)","v":0}]
[null,null,"",{"$f":"SUMIFS('CETAK NOTA'!$C$6:$C$21:'CETAK NOTA'!$C$1730:$C$1746,'CETAK NOTA'!$D$6:$D$21:'CETAK NOTA'!$D$1730:$D$1746,E365,'CETAK NOTA'!$B$6:$B$21:'CETAK NOTA'!$B$1730:$B$1746,B365)","v":0},null,{"$f":"SUMIFS('CETAK NOTA'!$C$6:$C$21:'CETAK NOTA'!$C$1730:$C$1746,'CETAK NOTA'!$D$6:$D$21:'CETAK NOTA'!$D$1730:$D$1746,G365,'CETAK NOTA'!$B$6:$B$21:'CETAK NOTA'!$B$1730:$B$1746,B365)","v":0}]
[null,null,"",{"$f":"SUMIFS('CETAK NOTA'!$C$6:$C$21:'CETAK NOTA'!$C$1730:$C$1746,'CETAK NOTA'!$D$6:$D$21:'CETAK NOTA'!$D$1730:$D$1746,E366,'CETAK NOTA'!$B$6:$B$21:'CETAK NOTA'!$B$1730:$B$1746,B366)","v":0},null,{"$f":"SUMIFS('CETAK NOTA'!$C$6:$C$21:'CETAK NOTA'!$C$1730:$C$1746,'CETAK NOTA'!$D$6:$D$21:'CETAK NOTA'!$D$1730:$D$1746,G366,'CETAK NOTA'!$B$6:$B$21:'CETAK NOTA'!$B$1730:$B$1746,B366)","v":0}]
[null,null,"",{"$f":"SUMIFS('CETAK NOTA'!$C$6:$C$21:'CETAK NOTA'!$C$1730:$C$1746,'CETAK NOTA'!$D$6:$D$21:'CETAK NOTA'!$D$1730:$D$1746,E367,'CETAK NOTA'!$B$6:$B$21:'CETAK NOTA'!$B$1730:$B$1746,B367)","v":0},null,{"$f":"SUMIFS('CETAK NOTA'!$C$6:$C$21:'CETAK NOTA'!$C$1730:$C$1746,'CETAK NOTA'!$D$6:$D$21:'CETAK NOTA'!$D$1730:$D$1746,G367,'CETAK NOTA'!$B$6:$B$21:'CETAK NOTA'!$B$1730:$B$1746,B367)","v":0}]
[null,null,"",{"$f":"SUMIFS('CETAK NOTA'!$C$6:$C$21:'CETAK NOTA'!$C$1730:$C$1746,'CETAK NOTA'!$D$6:$D$21:'CETAK NOTA'!$D$1730:$D$1746,E368,'CETAK NOTA'!$B$6:$B$21:'CETAK NOTA'!$B$1730:$B$1746,B368)","v":0},null,{"$f":"SUMIFS('CETAK NOTA'!$C$6:$C$21:'CETAK NOTA'!$C$1730:$C$1746,'CETAK NOTA'!$D$6:$D$21:'CETAK NOTA'!$D$1730:$D$1746,G368,'CETAK NOTA'!$B$6:$B$21:'CETAK NOTA'!$B$1730:$B$1746,B368)","v":0}]
[null,null,"",{"$f":"SUMIFS('CETAK NOTA'!$C$6:$C$21:'CETAK NOTA'!$C$1730:$C$1746,'CETAK NOTA'!$D$6:$D$21:'CETAK NOTA'!$D$1730:$D$1746,E369,'CETAK NOTA'!$B$6:$B$21:'CETAK NOTA'!$B$1730:$B$1746,B369)","v":0},null,{"$f":"SUMIFS('CETAK NOTA'!$C$6:$C$21:'CETAK NOTA'!$C$1730:$C$1746,'CETAK NOTA'!$D$6:$D$21:'CETAK NOTA'!$D$1730:$D$1746,G369,'CETAK NOTA'!$B$6:$B$21:'CETAK NOTA'!$B$1730:$B$1746,B369)","v":0}]
[null,null,"",{"$f":"SUMIFS('CETAK NOTA'!$C$6:$C$21:'CETAK NOTA'!$C$1730:$C$1746,'CETAK NOTA'!$D$6:$D$21:'CETAK NOTA'!$D$1730:$D$1746,E370,'CETAK NOTA'!$B$6:$B$21:'CETAK NOTA'!$B$1730:$B$1746,B370)","v":0},null,{"$f":"SUMIFS('CETAK NOTA'!$C$6:$C$21:'CETAK NOTA'!$C$1730:$C$1746,'CETAK NOTA'!$D$6:$D$21:'CETAK NOTA'!$D$1730:$D$1746,G370,'CETAK NOTA'!$B$6:$B$21:'CETAK NOTA'!$B$1730:$B$1746,B370)","v":0}]
[null,null,"",{"$f":"SUMIFS('CETAK NOTA'!$C$6:$C$21:'CETAK NOTA'!$C$1730:$C$1746,'CETAK NOTA'!$D$6:$D$21:'CETAK NOTA'!$D$1730:$D$1746,E371,'CETAK NOTA'!$B$6:$B$21:'CETAK NOTA'!$B$1730:$B$1746,B371)","v":0},null,{"$f":"SUMIFS('CETAK NOTA'!$C$6:$C$21:'CETAK NOTA'!$C$1730:$C$1746,'CETAK NOTA'!$D$6:$D$21:'CETAK NOTA'!$D$1730:$D$1746,G371,'CETAK NOTA'!$B$6:$B$21:'CETAK NOTA'!$B$1730:$B$1746,B371)","v":0}]
[null,null,"",{"$f":"SUMIFS('CETAK NOTA'!$C$6:$C$21:'CETAK NOTA'!$C$1730:$C$1746,'CETAK NOTA'!$D$6:$D$21:'CETAK NOTA'!$D$1730:$D$1746,E372,'CETAK NOTA'!$B$6:$B$21:'CETAK NOTA'!$B$1730:$B$1746,B372)","v":0},null,{"$f":"SUMIFS('CETAK NOTA'!$C$6:$C$21:'CETAK NOTA'!$C$1730:$C$1746,'CETAK NOTA'!$D$6:$D$21:'CETAK NOTA'!$D$1730:$D$1746,G372,'CETAK NOTA'!$B$6:$B$21:'CETAK NOTA'!$B$1730:$B$1746,B372)","v":0}]
[null,null,"",{"$f":"SUMIFS('CETAK NOTA'!$C$6:$C$21:'CETAK NOTA'!$C$1730:$C$1746,'CETAK NOTA'!$D$6:$D$21:'CETAK NOTA'!$D$1730:$D$1746,E373,'CETAK NOTA'!$B$6:$B$21:'CETAK NOTA'!$B$1730:$B$1746,B373)","v":0},null,{"$f":"SUMIFS('CETAK NOTA'!$C$6:$C$21:'CETAK NOTA'!$C$1730:$C$1746,'CETAK NOTA'!$D$6:$D$21:'CETAK NOTA'!$D$1730:$D$1746,G373,'CETAK NOTA'!$B$6:$B$21:'CETAK NOTA'!$B$1730:$B$1746,B373)","v":0}]
[null,null,"",{"$f":"SUMIFS('CETAK NOTA'!$C$6:$C$21:'CETAK NOTA'!$C$1730:$C$1746,'CETAK NOTA'!$D$6:$D$21:'CETAK NOTA'!$D$1730:$D$1746,E374,'CETAK NOTA'!$B$6:$B$21:'CETAK NOTA'!$B$1730:$B$1746,B374)","v":0},null,{"$f":"SUMIFS('CETAK NOTA'!$C$6:$C$21:'CETAK NOTA'!$C$1730:$C$1746,'CETAK NOTA'!$D$6:$D$21:'CETAK NOTA'!$D$1730:$D$1746,G374,'CETAK NOTA'!$B$6:$B$21:'CETAK NOTA'!$B$1730:$B$1746,B374)","v":0}]
[null,null,"",{"$f":"SUMIFS('CETAK NOTA'!$C$6:$C$21:'CETAK NOTA'!$C$1730:$C$1746,'CETAK NOTA'!$D$6:$D$21:'CETAK NOTA'!$D$1730:$D$1746,E375,'CETAK NOTA'!$B$6:$B$21:'CETAK NOTA'!$B$1730:$B$1746,B375)","v":0},null,{"$f":"SUMIFS('CETAK NOTA'!$C$6:$C$21:'CETAK NOTA'!$C$1730:$C$1746,'CETAK NOTA'!$D$6:$D$21:'CETAK NOTA'!$D$1730:$D$1746,G375,'CETAK NOTA'!$B$6:$B$21:'CETAK NOTA'!$B$1730:$B$1746,B375)","v":0}]
[null,null,"",{"$f":"SUMIFS('CETAK NOTA'!$C$6:$C$21:'CETAK NOTA'!$C$1730:$C$1746,'CETAK NOTA'!$D$6:$D$21:'CETAK NOTA'!$D$1730:$D$1746,E376,'CETAK NOTA'!$B$6:$B$21:'CETAK NOTA'!$B$1730:$B$1746,B376)","v":0},null,{"$f":"SUMIFS('CETAK NOTA'!$C$6:$C$21:'CETAK NOTA'!$C$1730:$C$1746,'CETAK NOTA'!$D$6:$D$21:'CETAK NOTA'!$D$1730:$D$1746,G376,'CETAK NOTA'!$B$6:$B$21:'CETAK NOTA'!$B$1730:$B$1746,B376)","v":0}]
[null,null,"",{"$f":"SUMIFS('CETAK NOTA'!$C$6:$C$21:'CETAK NOTA'!$C$1730:$C$1746,'CETAK NOTA'!$D$6:$D$21:'CETAK NOTA'!$D$1730:$D$1746,E377,'CETAK NOTA'!$B$6:$B$21:'CETAK NOTA'!$B$1730:$B$1746,B377)","v":0},null,{"$f":"SUMIFS('CETAK NOTA'!$C$6:$C$21:'CETAK NOTA'!$C$1730:$C$1746,'CETAK NOTA'!$D$6:$D$21:'CETAK NOTA'!$D$1730:$D$1746,G377,'CETAK NOTA'!$B$6:$B$21:'CETAK NOTA'!$B$1730:$B$1746,B377)","v":0}]
[null,null,"",{"$f":"SUMIFS('CETAK NOTA'!$C$6:$C$21:'CETAK NOTA'!$C$1730:$C$1746,'CETAK NOTA'!$D$6:$D$21:'CETAK NOTA'!$D$1730:$D$1746,E378,'CETAK NOTA'!$B$6:$B$21:'CETAK NOTA'!$B$1730:$B$1746,B378)","v":0},null,{"$f":"SUMIFS('CETAK NOTA'!$C$6:$C$21:'CETAK NOTA'!$C$1730:$C$1746,'CETAK NOTA'!$D$6:$D$21:'CETAK NOTA'!$D$1730:$D$1746,G378,'CETAK NOTA'!$B$6:$B$21:'CETAK NOTA'!$B$1730:$B$1746,B378)","v":0}]
[null,null,"",{"$f":"SUMIFS('CETAK NOTA'!$C$6:$C$21:'CETAK NOTA'!$C$1730:$C$1746,'CETAK NOTA'!$D$6:$D$21:'CETAK NOTA'!$D$1730:$D$1746,E379,'CETAK NOTA'!$B$6:$B$21:'CETAK NOTA'!$B$1730:$B$1746,B379)","v":0},null,{"$f":"SUMIFS('CETAK NOTA'!$C$6:$C$21:'CETAK NOTA'!$C$1730:$C$1746,'CETAK NOTA'!$D$6:$D$21:'CETAK NOTA'!$D$1730:$D$1746,G379,'CETAK NOTA'!$B$6:$B$21:'CETAK NOTA'!$B$1730:$B$1746,B379)","v":0}]
[null,null,"",{"$f":"SUMIFS('CETAK NOTA'!$C$6:$C$21:'CETAK NOTA'!$C$1730:$C$1746,'CETAK NOTA'!$D$6:$D$21:'CETAK NOTA'!$D$1730:$D$1746,E380,'CETAK NOTA'!$B$6:$B$21:'CETAK NOTA'!$B$1730:$B$1746,B380)","v":0},null,{"$f":"SUMIFS('CETAK NOTA'!$C$6:$C$21:'CETAK NOTA'!$C$1730:$C$1746,'CETAK NOTA'!$D$6:$D$21:'CETAK NOTA'!$D$1730:$D$1746,G380,'CETAK NOTA'!$B$6:$B$21:'CETAK NOTA'!$B$1730:$B$1746,B380)","v":0}]
[null,null,"",{"$f":"SUMIFS('CETAK NOTA'!$C$6:$C$21:'CETAK NOTA'!$C$1730:$C$1746,'CETAK NOTA'!$D$6:$D$21:'CETAK NOTA'!$D$1730:$D$1746,E381,'CETAK NOTA'!$B$6:$B$21:'CETAK NOTA'!$B$1730:$B$1746,B381)","v":0},null,{"$f":"SUMIFS('CETAK NOTA'!$C$6:$C$21:'CETAK NOTA'!$C$1730:$C$1746,'CETAK NOTA'!$D$6:$D$21:'CETAK NOTA'!$D$1730:$D$1746,G381,'CETAK NOTA'!$B$6:$B$21:'CETAK NOTA'!$B$1730:$B$1746,B381)","v":0}]
[null,null,"",{"$f":"SUMIFS('CETAK NOTA'!$C$6:$C$21:'CETAK NOTA'!$C$1730:$C$1746,'CETAK NOTA'!$D$6:$D$21:'CETAK NOTA'!$D$1730:$D$1746,E382,'CETAK NOTA'!$B$6:$B$21:'CETAK NOTA'!$B$1730:$B$1746,B382)","v":0},null,{"$f":"SUMIFS('CETAK NOTA'!$C$6:$C$21:'CETAK NOTA'!$C$1730:$C$1746,'CETAK NOTA'!$D$6:$D$21:'CETAK NOTA'!$D$1730:$D$1746,G382,'CETAK NOTA'!$B$6:$B$21:'CETAK NOTA'!$B$1730:$B$1746,B382)","v":0}]
[null,null,"",{"$f":"SUMIFS('CETAK NOTA'!$C$6:$C$21:'CETAK NOTA'!$C$1730:$C$1746,'CETAK NOTA'!$D$6:$D$21:'CETAK NOTA'!$D$1730:$D$1746,E383,'CETAK NOTA'!$B$6:$B$21:'CETAK NOTA'!$B$1730:$B$1746,B383)","v":0},null,{"$f":"SUMIFS('CETAK NOTA'!$C$6:$C$21:'CETAK NOTA'!$C$1730:$C$1746,'CETAK NOTA'!$D$6:$D$21:'CETAK NOTA'!$D$1730:$D$1746,G383,'CETAK NOTA'!$B$6:$B$21:'CETAK NOTA'!$B$1730:$B$1746,B383)","v":0}]
[null,null,"",{"$f":"SUMIFS('CETAK NOTA'!$C$6:$C$21:'CETAK NOTA'!$C$1730:$C$1746,'CETAK NOTA'!$D$6:$D$21:'CETAK NOTA'!$D$1730:$D$1746,E384,'CETAK NOTA'!$B$6:$B$21:'CETAK NOTA'!$B$1730:$B$1746,B384)","v":0},null,{"$f":"SUMIFS('CETAK NOTA'!$C$6:$C$21:'CETAK NOTA'!$C$1730:$C$1746,'CETAK NOTA'!$D$6:$D$21:'CETAK NOTA'!$D$1730:$D$1746,G384,'CETAK NOTA'!$B$6:$B$21:'CETAK NOTA'!$B$1730:$B$1746,B384)","v":0}]
[null,null,"",{"$f":"SUMIFS('CETAK NOTA'!$C$6:$C$21:'CETAK NOTA'!$C$1730:$C$1746,'CETAK NOTA'!$D$6:$D$21:'CETAK NOTA'!$D$1730:$D$1746,E385,'CETAK NOTA'!$B$6:$B$21:'CETAK NOTA'!$B$1730:$B$1746,B385)","v":0},null,{"$f":"SUMIFS('CETAK NOTA'!$C$6:$C$21:'CETAK NOTA'!$C$1730:$C$1746,'CETAK NOTA'!$D$6:$D$21:'CETAK NOTA'!$D$1730:$D$1746,G385,'CETAK NOTA'!$B$6:$B$21:'CETAK NOTA'!$B$1730:$B$1746,B385)","v":0}]
[null,null,{"$f":"IF(AND(K386=0,L386=0),\"\",IF(AND(F386>0,K386>L386),\"RM\",\"TK\"))","v":""},{"$f":"SUMIFS('CETAK NOTA'!$C$6:$C$21:'CETAK NOTA'!$C$1730:$C$1746,'CETAK NOTA'!$D$6:$D$21:'CETAK NOTA'!$D$1730:$D$1746,E386,'CETAK NOTA'!$B$6:$B$21:'CETAK NOTA'!$B$1730:$B$1746,B386)","v":0},null,{"$f":"SUMIFS('CETAK NOTA'!$C$6:$C$21:'CETAK NOTA'!$C$1730:$C$1746,'CETAK NOTA'!$D$6:$D$21:'CETAK NOTA'!$D$1730:$D$1746,G386,'CETAK NOTA'!$B$6:$B$21:'CETAK NOTA'!$B$1730:$B$1746,B386)","v":0}]
[null,null,"",{"$f":"SUMIFS('CETAK NOTA'!$C$6:$C$21:'CETAK NOTA'!$C$1730:$C$1746,'CETAK NOTA'!$D$6:$D$21:'CETAK NOTA'!$D$1730:$D$1746,E387,'CETAK NOTA'!$B$6:$B$21:'CETAK NOTA'!$B$1730:$B$1746,B387)","v":0},null,{"$f":"SUMIFS('CETAK NOTA'!$C$6:$C$21:'CETAK NOTA'!$C$1730:$C$1746,'CETAK NOTA'!$D$6:$D$21:'CETAK NOTA'!$D$1730:$D$1746,G387,'CETAK NOTA'!$B$6:$B$21:'CETAK NOTA'!$B$1730:$B$1746,B387)","v":0}]
[null,null,"",{"$f":"SUMIFS('CETAK NOTA'!$C$6:$C$21:'CETAK NOTA'!$C$1730:$C$1746,'CETAK NOTA'!$D$6:$D$21:'CETAK NOTA'!$D$1730:$D$1746,E388,'CETAK NOTA'!$B$6:$B$21:'CETAK NOTA'!$B$1730:$B$1746,B388)","v":0},null,{"$f":"SUMIFS('CETAK NOTA'!$C$6:$C$21:'CETAK NOTA'!$C$1730:$C$1746,'CETAK NOTA'!$D$6:$D$21:'CETAK NOTA'!$D$1730:$D$1746,G388,'CETAK NOTA'!$B$6:$B$21:'CETAK NOTA'!$B$1730:$B$1746,B388)","v":0}]
[null,null,"",{"$f":"SUMIFS('CETAK NOTA'!$C$6:$C$21:'CETAK NOTA'!$C$1730:$C$1746,'CETAK NOTA'!$D$6:$D$21:'CETAK NOTA'!$D$1730:$D$1746,E389,'CETAK NOTA'!$B$6:$B$21:'CETAK NOTA'!$B$1730:$B$1746,B389)","v":0},null,{"$f":"SUMIFS('CETAK NOTA'!$C$6:$C$21:'CETAK NOTA'!$C$1730:$C$1746,'CETAK NOTA'!$D$6:$D$21:'CETAK NOTA'!$D$1730:$D$1746,G389,'CETAK NOTA'!$B$6:$B$21:'CETAK NOTA'!$B$1730:$B$1746,B389)","v":0}]
[null,null,"",{"$f":"SUMIFS('CETAK NOTA'!$C$6:$C$21:'CETAK NOTA'!$C$1730:$C$1746,'CETAK NOTA'!$D$6:$D$21:'CETAK NOTA'!$D$1730:$D$1746,E390,'CETAK NOTA'!$B$6:$B$21:'CETAK NOTA'!$B$1730:$B$1746,B390)","v":0},null,{"$f":"SUMIFS('CETAK NOTA'!$C$6:$C$21:'CETAK NOTA'!$C$1730:$C$1746,'CETAK NOTA'!$D$6:$D$21:'CETAK NOTA'!$D$1730:$D$1746,G390,'CETAK NOTA'!$B$6:$B$21:'CETAK NOTA'!$B$1730:$B$1746,B390)","v":0}]
[null,null,"",{"$f":"SUMIFS('CETAK NOTA'!$C$6:$C$21:'CETAK NOTA'!$C$1730:$C$1746,'CETAK NOTA'!$D$6:$D$21:'CETAK NOTA'!$D$1730:$D$1746,E391,'CETAK NOTA'!$B$6:$B$21:'CETAK NOTA'!$B$1730:$B$1746,B391)","v":0},null,{"$f":"SUMIFS('CETAK NOTA'!$C$6:$C$21:'CETAK NOTA'!$C$1730:$C$1746,'CETAK NOTA'!$D$6:$D$21:'CETAK NOTA'!$D$1730:$D$1746,G391,'CETAK NOTA'!$B$6:$B$21:'CETAK NOTA'!$B$1730:$B$1746,B391)","v":0}]
[null,null,"",{"$f":"SUMIFS('CETAK NOTA'!$C$6:$C$21:'CETAK NOTA'!$C$1730:$C$1746,'CETAK NOTA'!$D$6:$D$21:'CETAK NOTA'!$D$1730:$D$1746,E392,'CETAK NOTA'!$B$6:$B$21:'CETAK NOTA'!$B$1730:$B$1746,B392)","v":0},null,{"$f":"SUMIFS('CETAK NOTA'!$C$6:$C$21:'CETAK NOTA'!$C$1730:$C$1746,'CETAK NOTA'!$D$6:$D$21:'CETAK NOTA'!$D$1730:$D$1746,G392,'CETAK NOTA'!$B$6:$B$21:'CETAK NOTA'!$B$1730:$B$1746,B392)","v":0}]
[null,null,"",{"$f":"SUMIFS('CETAK NOTA'!$C$6:$C$21:'CETAK NOTA'!$C$1730:$C$1746,'CETAK NOTA'!$D$6:$D$21:'CETAK NOTA'!$D$1730:$D$1746,E393,'CETAK NOTA'!$B$6:$B$21:'CETAK NOTA'!$B$1730:$B$1746,B393)","v":0},null,{"$f":"SUMIFS('CETAK NOTA'!$C$6:$C$21:'CETAK NOTA'!$C$1730:$C$1746,'CETAK NOTA'!$D$6:$D$21:'CETAK NOTA'!$D$1730:$D$1746,G393,'CETAK NOTA'!$B$6:$B$21:'CETAK NOTA'!$B$1730:$B$1746,B393)","v":0}]
[null,null,"",{"$f":"SUMIFS('CETAK NOTA'!$C$6:$C$21:'CETAK NOTA'!$C$1730:$C$1746,'CETAK NOTA'!$D$6:$D$21:'CETAK NOTA'!$D$1730:$D$1746,E394,'CETAK NOTA'!$B$6:$B$21:'CETAK NOTA'!$B$1730:$B$1746,B394)","v":0},null,{"$f":"SUMIFS('CETAK NOTA'!$C$6:$C$21:'CETAK NOTA'!$C$1730:$C$1746,'CETAK NOTA'!$D$6:$D$21:'CETAK NOTA'!$D$1730:$D$1746,G394,'CETAK NOTA'!$B$6:$B$21:'CETAK NOTA'!$B$1730:$B$1746,B394)","v":0}]
[null,null,"",{"$f":"SUMIFS('CETAK NOTA'!$C$6:$C$21:'CETAK NOTA'!$C$1730:$C$1746,'CETAK NOTA'!$D$6:$D$21:'CETAK NOTA'!$D$1730:$D$1746,E395,'CETAK NOTA'!$B$6:$B$21:'CETAK NOTA'!$B$1730:$B$1746,B395)","v":0},null,{"$f":"SUMIFS('CETAK NOTA'!$C$6:$C$21:'CETAK NOTA'!$C$1730:$C$1746,'CETAK NOTA'!$D$6:$D$21:'CETAK NOTA'!$D$1730:$D$1746,G395,'CETAK NOTA'!$B$6:$B$21:'CETAK NOTA'!$B$1730:$B$1746,B395)","v":0}]
[null,null,"",{"$f":"SUMIFS('CETAK NOTA'!$C$6:$C$21:'CETAK NOTA'!$C$1730:$C$1746,'CETAK NOTA'!$D$6:$D$21:'CETAK NOTA'!$D$1730:$D$1746,E396,'CETAK NOTA'!$B$6:$B$21:'CETAK NOTA'!$B$1730:$B$1746,B396)","v":0},null,{"$f":"SUMIFS('CETAK NOTA'!$C$6:$C$21:'CETAK NOTA'!$C$1730:$C$1746,'CETAK NOTA'!$D$6:$D$21:'CETAK NOTA'!$D$1730:$D$1746,G396,'CETAK NOTA'!$B$6:$B$21:'CETAK NOTA'!$B$1730:$B$1746,B396)","v":0}]
[null,null,"",{"$f":"SUMIFS('CETAK NOTA'!$C$6:$C$21:'CETAK NOTA'!$C$1730:$C$1746,'CETAK NOTA'!$D$6:$D$21:'CETAK NOTA'!$D$1730:$D$1746,E397,'CETAK NOTA'!$B$6:$B$21:'CETAK NOTA'!$B$1730:$B$1746,B397)","v":0},null,{"$f":"SUMIFS('CETAK NOTA'!$C$6:$C$21:'CETAK NOTA'!$C$1730:$C$1746,'CETAK NOTA'!$D$6:$D$21:'CETAK NOTA'!$D$1730:$D$1746,G397,'CETAK NOTA'!$B$6:$B$21:'CETAK NOTA'!$B$1730:$B$1746,B397)","v":0}]
[null,null,"",{"$f":"SUMIFS('CETAK NOTA'!$C$6:$C$21:'CETAK NOTA'!$C$1730:$C$1746,'CETAK NOTA'!$D$6:$D$21:'CETAK NOTA'!$D$1730:$D$1746,E398,'CETAK NOTA'!$B$6:$B$21:'CETAK NOTA'!$B$1730:$B$1746,B398)","v":0},null,{"$f":"SUMIFS('CETAK NOTA'!$C$6:$C$21:'CETAK NOTA'!$C$1730:$C$1746,'CETAK NOTA'!$D$6:$D$21:'CETAK NOTA'!$D$1730:$D$1746,G398,'CETAK NOTA'!$B$6:$B$21:'CETAK NOTA'!$B$1730:$B$1746,B398)","v":0}]
[null,null,"",{"$f":"SUMIFS('CETAK NOTA'!$C$6:$C$21:'CETAK NOTA'!$C$1730:$C$1746,'CETAK NOTA'!$D$6:$D$21:'CETAK NOTA'!$D$1730:$D$1746,E399,'CETAK NOTA'!$B$6:$B$21:'CETAK NOTA'!$B$1730:$B$1746,B399)","v":0},null,{"$f":"SUMIFS('CETAK NOTA'!$C$6:$C$21:'CETAK NOTA'!$C$1730:$C$1746,'CETAK NOTA'!$D$6:$D$21:'CETAK NOTA'!$D$1730:$D$1746,G399,'CETAK NOTA'!$B$6:$B$21:'CETAK NOTA'!$B$1730:$B$1746,B399)","v":0}]
[null,null,"",{"$f":"SUMIFS('CETAK NOTA'!$C$6:$C$21:'CETAK NOTA'!$C$1730:$C$1746,'CETAK NOTA'!$D$6:$D$21:'CETAK NOTA'!$D$1730:$D$1746,E400,'CETAK NOTA'!$B$6:$B$21:'CETAK NOTA'!$B$1730:$B$1746,B400)","v":0},null,{"$f":"SUMIFS('CETAK NOTA'!$C$6:$C$21:'CETAK NOTA'!$C$1730:$C$1746,'CETAK NOTA'!$D$6:$D$21:'CETAK NOTA'!$D$1730:$D$1746,G400,'CETAK NOTA'!$B$6:$B$21:'CETAK NOTA'!$B$1730:$B$1746,B400)","v":0}]
[null,null,"",{"$f":"SUMIFS('CETAK NOTA'!$C$6:$C$21:'CETAK NOTA'!$C$1730:$C$1746,'CETAK NOTA'!$D$6:$D$21:'CETAK NOTA'!$D$1730:$D$1746,E401,'CETAK NOTA'!$B$6:$B$21:'CETAK NOTA'!$B$1730:$B$1746,B401)","v":0},null,{"$f":"SUMIFS('CETAK NOTA'!$C$6:$C$21:'CETAK NOTA'!$C$1730:$C$1746,'CETAK NOTA'!$D$6:$D$21:'CETAK NOTA'!$D$1730:$D$1746,G401,'CETAK NOTA'!$B$6:$B$21:'CETAK NOTA'!$B$1730:$B$1746,B401)","v":0}]
[null,null,"",{"$f":"SUMIFS('CETAK NOTA'!$C$6:$C$21:'CETAK NOTA'!$C$1730:$C$1746,'CETAK NOTA'!$D$6:$D$21:'CETAK NOTA'!$D$1730:$D$1746,E402,'CETAK NOTA'!$B$6:$B$21:'CETAK NOTA'!$B$1730:$B$1746,B402)","v":0},null,{"$f":"SUMIFS('CETAK NOTA'!$C$6:$C$21:'CETAK NOTA'!$C$1730:$C$1746,'CETAK NOTA'!$D$6:$D$21:'CETAK NOTA'!$D$1730:$D$1746,G402,'CETAK NOTA'!$B$6:$B$21:'CETAK NOTA'!$B$1730:$B$1746,B402)","v":0}]
[null,null,"",{"$f":"SUMIFS('CETAK NOTA'!$C$6:$C$21:'CETAK NOTA'!$C$1730:$C$1746,'CETAK NOTA'!$D$6:$D$21:'CETAK NOTA'!$D$1730:$D$1746,E403,'CETAK NOTA'!$B$6:$B$21:'CETAK NOTA'!$B$1730:$B$1746,B403)","v":0},null,{"$f":"SUMIFS('CETAK NOTA'!$C$6:$C$21:'CETAK NOTA'!$C$1730:$C$1746,'CETAK NOTA'!$D$6:$D$21:'CETAK NOTA'!$D$1730:$D$1746,G403,'CETAK NOTA'!$B$6:$B$21:'CETAK NOTA'!$B$1730:$B$1746,B403)","v":0}]
[null,null,"",{"$f":"SUMIFS('CETAK NOTA'!$C$6:$C$21:'CETAK NOTA'!$C$1730:$C$1746,'CETAK NOTA'!$D$6:$D$21:'CETAK NOTA'!$D$1730:$D$1746,E404,'CETAK NOTA'!$B$6:$B$21:'CETAK NOTA'!$B$1730:$B$1746,B404)","v":0},null,{"$f":"SUMIFS('CETAK NOTA'!$C$6:$C$21:'CETAK NOTA'!$C$1730:$C$1746,'CETAK NOTA'!$D$6:$D$21:'CETAK NOTA'!$D$1730:$D$1746,G404,'CETAK NOTA'!$B$6:$B$21:'CETAK NOTA'!$B$1730:$B$1746,B404)","v":0}]
[null,null,"",{"$f":"SUMIFS('CETAK NOTA'!$C$6:$C$21:'CETAK NOTA'!$C$1730:$C$1746,'CETAK NOTA'!$D$6:$D$21:'CETAK NOTA'!$D$1730:$D$1746,E405,'CETAK NOTA'!$B$6:$B$21:'CETAK NOTA'!$B$1730:$B$1746,B405)","v":0},null,{"$f":"SUMIFS('CETAK NOTA'!$C$6:$C$21:'CETAK NOTA'!$C$1730:$C$1746,'CETAK NOTA'!$D$6:$D$21:'CETAK NOTA'!$D$1730:$D$1746,G405,'CETAK NOTA'!$B$6:$B$21:'CETAK NOTA'!$B$1730:$B$1746,B405)","v":0}]
[null,null,"",{"$f":"SUMIFS('CETAK NOTA'!$C$6:$C$21:'CETAK NOTA'!$C$1730:$C$1746,'CETAK NOTA'!$D$6:$D$21:'CETAK NOTA'!$D$1730:$D$1746,E406,'CETAK NOTA'!$B$6:$B$21:'CETAK NOTA'!$B$1730:$B$1746,B406)","v":0},null,{"$f":"SUMIFS('CETAK NOTA'!$C$6:$C$21:'CETAK NOTA'!$C$1730:$C$1746,'CETAK NOTA'!$D$6:$D$21:'CETAK NOTA'!$D$1730:$D$1746,G406,'CETAK NOTA'!$B$6:$B$21:'CETAK NOTA'!$B$1730:$B$1746,B406)","v":0}]
[null,null,"",{"$f":"SUMIFS('CETAK NOTA'!$C$6:$C$21:'CETAK NOTA'!$C$1730:$C$1746,'CETAK NOTA'!$D$6:$D$21:'CETAK NOTA'!$D$1730:$D$1746,E407,'CETAK NOTA'!$B$6:$B$21:'CETAK NOTA'!$B$1730:$B$1746,B407)","v":0},null,{"$f":"SUMIFS('CETAK NOTA'!$C$6:$C$21:'CETAK NOTA'!$C$1730:$C$1746,'CETAK NOTA'!$D$6:$D$21:'CETAK NOTA'!$D$1730:$D$1746,G407,'CETAK NOTA'!$B$6:$B$21:'CETAK NOTA'!$B$1730:$B$1746,B407)","v":0}]
[null,null,"",{"$f":"SUMIFS('CETAK NOTA'!$C$6:$C$21:'CETAK NOTA'!$C$1730:$C$1746,'CETAK NOTA'!$D$6:$D$21:'CETAK NOTA'!$D$1730:$D$1746,E408,'CETAK NOTA'!$B$6:$B$21:'CETAK NOTA'!$B$1730:$B$1746,B408)","v":0},null,{"$f":"SUMIFS('CETAK NOTA'!$C$6:$C$21:'CETAK NOTA'!$C$1730:$C$1746,'CETAK NOTA'!$D$6:$D$21:'CETAK NOTA'!$D$1730:$D$1746,G408,'CETAK NOTA'!$B$6:$B$21:'CETAK NOTA'!$B$1730:$B$1746,B408)","v":0}]
[null,null,"",{"$f":"SUMIFS('CETAK NOTA'!$C$6:$C$21:'CETAK NOTA'!$C$1730:$C$1746,'CETAK NOTA'!$D$6:$D$21:'CETAK NOTA'!$D$1730:$D$1746,E409,'CETAK NOTA'!$B$6:$B$21:'CETAK NOTA'!$B$1730:$B$1746,B409)","v":0},null,{"$f":"SUMIFS('CETAK NOTA'!$C$6:$C$21:'CETAK NOTA'!$C$1730:$C$1746,'CETAK NOTA'!$D$6:$D$21:'CETAK NOTA'!$D$1730:$D$1746,G409,'CETAK NOTA'!$B$6:$B$21:'CETAK NOTA'!$B$1730:$B$1746,B409)","v":0}]
[null,null,"",{"$f":"SUMIFS('CETAK NOTA'!$C$6:$C$21:'CETAK NOTA'!$C$1730:$C$1746,'CETAK NOTA'!$D$6:$D$21:'CETAK NOTA'!$D$1730:$D$1746,E410,'CETAK NOTA'!$B$6:$B$21:'CETAK NOTA'!$B$1730:$B$1746,B410)","v":0},null,{"$f":"SUMIFS('CETAK NOTA'!$C$6:$C$21:'CETAK NOTA'!$C$1730:$C$1746,'CETAK NOTA'!$D$6:$D$21:'CETAK NOTA'!$D$1730:$D$1746,G410,'CETAK NOTA'!$B$6:$B$21:'CETAK NOTA'!$B$1730:$B$1746,B410)","v":0}]
[null,null,"",{"$f":"SUMIFS('CETAK NOTA'!$C$6:$C$21:'CETAK NOTA'!$C$1730:$C$1746,'CETAK NOTA'!$D$6:$D$21:'CETAK NOTA'!$D$1730:$D$1746,E411,'CETAK NOTA'!$B$6:$B$21:'CETAK NOTA'!$B$1730:$B$1746,B411)","v":0},null,{"$f":"SUMIFS('CETAK NOTA'!$C$6:$C$21:'CETAK NOTA'!$C$1730:$C$1746,'CETAK NOTA'!$D$6:$D$21:'CETAK NOTA'!$D$1730:$D$1746,G411,'CETAK NOTA'!$B$6:$B$21:'CETAK NOTA'!$B$1730:$B$1746,B411)","v":0}]
[null,null,"",{"$f":"SUMIFS('CETAK NOTA'!$C$6:$C$21:'CETAK NOTA'!$C$1730:$C$1746,'CETAK NOTA'!$D$6:$D$21:'CETAK NOTA'!$D$1730:$D$1746,E412,'CETAK NOTA'!$B$6:$B$21:'CETAK NOTA'!$B$1730:$B$1746,B412)","v":0},null,{"$f":"SUMIFS('CETAK NOTA'!$C$6:$C$21:'CETAK NOTA'!$C$1730:$C$1746,'CETAK NOTA'!$D$6:$D$21:'CETAK NOTA'!$D$1730:$D$1746,G412,'CETAK NOTA'!$B$6:$B$21:'CETAK NOTA'!$B$1730:$B$1746,B412)","v":0}]
[null,null,"",{"$f":"SUMIFS('CETAK NOTA'!$C$6:$C$21:'CETAK NOTA'!$C$1730:$C$1746,'CETAK NOTA'!$D$6:$D$21:'CETAK NOTA'!$D$1730:$D$1746,E413,'CETAK NOTA'!$B$6:$B$21:'CETAK NOTA'!$B$1730:$B$1746,B413)","v":0},null,{"$f":"SUMIFS('CETAK NOTA'!$C$6:$C$21:'CETAK NOTA'!$C$1730:$C$1746,'CETAK NOTA'!$D$6:$D$21:'CETAK NOTA'!$D$1730:$D$1746,G413,'CETAK NOTA'!$B$6:$B$21:'CETAK NOTA'!$B$1730:$B$1746,B413)","v":0}]
[null,null,"",{"$f":"SUMIFS('CETAK NOTA'!$C$6:$C$21:'CETAK NOTA'!$C$1730:$C$1746,'CETAK NOTA'!$D$6:$D$21:'CETAK NOTA'!$D$1730:$D$1746,E414,'CETAK NOTA'!$B$6:$B$21:'CETAK NOTA'!$B$1730:$B$1746,B414)","v":0},null,{"$f":"SUMIFS('CETAK NOTA'!$C$6:$C$21:'CETAK NOTA'!$C$1730:$C$1746,'CETAK NOTA'!$D$6:$D$21:'CETAK NOTA'!$D$1730:$D$1746,G414,'CETAK NOTA'!$B$6:$B$21:'CETAK NOTA'!$B$1730:$B$1746,B414)","v":0}]
[null,null,"",{"$f":"SUMIFS('CETAK NOTA'!$C$6:$C$21:'CETAK NOTA'!$C$1730:$C$1746,'CETAK NOTA'!$D$6:$D$21:'CETAK NOTA'!$D$1730:$D$1746,E415,'CETAK NOTA'!$B$6:$B$21:'CETAK NOTA'!$B$1730:$B$1746,B415)","v":0},null,{"$f":"SUMIFS('CETAK NOTA'!$C$6:$C$21:'CETAK NOTA'!$C$1730:$C$1746,'CETAK NOTA'!$D$6:$D$21:'CETAK NOTA'!$D$1730:$D$1746,G415,'CETAK NOTA'!$B$6:$B$21:'CETAK NOTA'!$B$1730:$B$1746,B415)","v":0}]
[null,null,"",{"$f":"SUMIFS('CETAK NOTA'!$C$6:$C$21:'CETAK NOTA'!$C$1730:$C$1746,'CETAK NOTA'!$D$6:$D$21:'CETAK NOTA'!$D$1730:$D$1746,E416,'CETAK NOTA'!$B$6:$B$21:'CETAK NOTA'!$B$1730:$B$1746,B416)","v":0},null,{"$f":"SUMIFS('CETAK NOTA'!$C$6:$C$21:'CETAK NOTA'!$C$1730:$C$1746,'CETAK NOTA'!$D$6:$D$21:'CETAK NOTA'!$D$1730:$D$1746,G416,'CETAK NOTA'!$B$6:$B$21:'CETAK NOTA'!$B$1730:$B$1746,B416)","v":0}]
[null,null,"",{"$f":"SUMIFS('CETAK NOTA'!$C$6:$C$21:'CETAK NOTA'!$C$1730:$C$1746,'CETAK NOTA'!$D$6:$D$21:'CETAK NOTA'!$D$1730:$D$1746,E417,'CETAK NOTA'!$B$6:$B$21:'CETAK NOTA'!$B$1730:$B$1746,B417)","v":0},null,{"$f":"SUMIFS('CETAK NOTA'!$C$6:$C$21:'CETAK NOTA'!$C$1730:$C$1746,'CETAK NOTA'!$D$6:$D$21:'CETAK NOTA'!$D$1730:$D$1746,G417,'CETAK NOTA'!$B$6:$B$21:'CETAK NOTA'!$B$1730:$B$1746,B417)","v":0}]
[null,null,{"$f":"IF(AND(K418=0,L418=0),\"\",IF(AND(F418>0,K418>L418),\"RM\",\"TK\"))","v":""},{"$f":"SUMIFS('CETAK NOTA'!$C$6:$C$21:'CETAK NOTA'!$C$1730:$C$1746,'CETAK NOTA'!$D$6:$D$21:'CETAK NOTA'!$D$1730:$D$1746,E418,'CETAK NOTA'!$B$6:$B$21:'CETAK NOTA'!$B$1730:$B$1746,B418)","v":0},null,{"$f":"SUMIFS('CETAK NOTA'!$C$6:$C$21:'CETAK NOTA'!$C$1730:$C$1746,'CETAK NOTA'!$D$6:$D$21:'CETAK NOTA'!$D$1730:$D$1746,G418,'CETAK NOTA'!$B$6:$B$21:'CETAK NOTA'!$B$1730:$B$1746,B418)","v":0}]
[null,null,"",{"$f":"SUMIFS('CETAK NOTA'!$C$6:$C$21:'CETAK NOTA'!$C$1730:$C$1746,'CETAK NOTA'!$D$6:$D$21:'CETAK NOTA'!$D$1730:$D$1746,E419,'CETAK NOTA'!$B$6:$B$21:'CETAK NOTA'!$B$1730:$B$1746,B419)","v":0},null,{"$f":"SUMIFS('CETAK NOTA'!$C$6:$C$21:'CETAK NOTA'!$C$1730:$C$1746,'CETAK NOTA'!$D$6:$D$21:'CETAK NOTA'!$D$1730:$D$1746,G419,'CETAK NOTA'!$B$6:$B$21:'CETAK NOTA'!$B$1730:$B$1746,B419)","v":0}]
[null,null,"",{"$f":"SUMIFS('CETAK NOTA'!$C$6:$C$21:'CETAK NOTA'!$C$1730:$C$1746,'CETAK NOTA'!$D$6:$D$21:'CETAK NOTA'!$D$1730:$D$1746,E420,'CETAK NOTA'!$B$6:$B$21:'CETAK NOTA'!$B$1730:$B$1746,B420)","v":0},null,{"$f":"SUMIFS('CETAK NOTA'!$C$6:$C$21:'CETAK NOTA'!$C$1730:$C$1746,'CETAK NOTA'!$D$6:$D$21:'CETAK NOTA'!$D$1730:$D$1746,G420,'CETAK NOTA'!$B$6:$B$21:'CETAK NOTA'!$B$1730:$B$1746,B420)","v":0}]
[null,null,"",{"$f":"SUMIFS('CETAK NOTA'!$C$6:$C$21:'CETAK NOTA'!$C$1730:$C$1746,'CETAK NOTA'!$D$6:$D$21:'CETAK NOTA'!$D$1730:$D$1746,E421,'CETAK NOTA'!$B$6:$B$21:'CETAK NOTA'!$B$1730:$B$1746,B421)","v":0},null,{"$f":"SUMIFS('CETAK NOTA'!$C$6:$C$21:'CETAK NOTA'!$C$1730:$C$1746,'CETAK NOTA'!$D$6:$D$21:'CETAK NOTA'!$D$1730:$D$1746,G421,'CETAK NOTA'!$B$6:$B$21:'CETAK NOTA'!$B$1730:$B$1746,B421)","v":0}]
[null,null,"",{"$f":"SUMIFS('CETAK NOTA'!$C$6:$C$21:'CETAK NOTA'!$C$1730:$C$1746,'CETAK NOTA'!$D$6:$D$21:'CETAK NOTA'!$D$1730:$D$1746,E422,'CETAK NOTA'!$B$6:$B$21:'CETAK NOTA'!$B$1730:$B$1746,B422)","v":0},null,{"$f":"SUMIFS('CETAK NOTA'!$C$6:$C$21:'CETAK NOTA'!$C$1730:$C$1746,'CETAK NOTA'!$D$6:$D$21:'CETAK NOTA'!$D$1730:$D$1746,G422,'CETAK NOTA'!$B$6:$B$21:'CETAK NOTA'!$B$1730:$B$1746,B422)","v":0}]
[null,null,"",{"$f":"SUMIFS('CETAK NOTA'!$C$6:$C$21:'CETAK NOTA'!$C$1730:$C$1746,'CETAK NOTA'!$D$6:$D$21:'CETAK NOTA'!$D$1730:$D$1746,E423,'CETAK NOTA'!$B$6:$B$21:'CETAK NOTA'!$B$1730:$B$1746,B423)","v":0},null,{"$f":"SUMIFS('CETAK NOTA'!$C$6:$C$21:'CETAK NOTA'!$C$1730:$C$1746,'CETAK NOTA'!$D$6:$D$21:'CETAK NOTA'!$D$1730:$D$1746,G423,'CETAK NOTA'!$B$6:$B$21:'CETAK NOTA'!$B$1730:$B$1746,B423)","v":0}]
[null,null,"",{"$f":"SUMIFS('CETAK NOTA'!$C$6:$C$21:'CETAK NOTA'!$C$1730:$C$1746,'CETAK NOTA'!$D$6:$D$21:'CETAK NOTA'!$D$1730:$D$1746,E424,'CETAK NOTA'!$B$6:$B$21:'CETAK NOTA'!$B$1730:$B$1746,B424)","v":0},null,{"$f":"SUMIFS('CETAK NOTA'!$C$6:$C$21:'CETAK NOTA'!$C$1730:$C$1746,'CETAK NOTA'!$D$6:$D$21:'CETAK NOTA'!$D$1730:$D$1746,G424,'CETAK NOTA'!$B$6:$B$21:'CETAK NOTA'!$B$1730:$B$1746,B424)","v":0}]
[null,null,"",{"$f":"SUMIFS('CETAK NOTA'!$C$6:$C$21:'CETAK NOTA'!$C$1730:$C$1746,'CETAK NOTA'!$D$6:$D$21:'CETAK NOTA'!$D$1730:$D$1746,E425,'CETAK NOTA'!$B$6:$B$21:'CETAK NOTA'!$B$1730:$B$1746,B425)","v":0},null,{"$f":"SUMIFS('CETAK NOTA'!$C$6:$C$21:'CETAK NOTA'!$C$1730:$C$1746,'CETAK NOTA'!$D$6:$D$21:'CETAK NOTA'!$D$1730:$D$1746,G425,'CETAK NOTA'!$B$6:$B$21:'CETAK NOTA'!$B$1730:$B$1746,B425)","v":0}]
[null,null,"",{"$f":"SUMIFS('CETAK NOTA'!$C$6:$C$21:'CETAK NOTA'!$C$1730:$C$1746,'CETAK NOTA'!$D$6:$D$21:'CETAK NOTA'!$D$1730:$D$1746,E426,'CETAK NOTA'!$B$6:$B$21:'CETAK NOTA'!$B$1730:$B$1746,B426)","v":0},null,{"$f":"SUMIFS('CETAK NOTA'!$C$6:$C$21:'CETAK NOTA'!$C$1730:$C$1746,'CETAK NOTA'!$D$6:$D$21:'CETAK NOTA'!$D$1730:$D$1746,G426,'CETAK NOTA'!$B$6:$B$21:'CETAK NOTA'!$B$1730:$B$1746,B426)","v":0}]
[null,null,"",{"$f":"SUMIFS('CETAK NOTA'!$C$6:$C$21:'CETAK NOTA'!$C$1730:$C$1746,'CETAK NOTA'!$D$6:$D$21:'CETAK NOTA'!$D$1730:$D$1746,E427,'CETAK NOTA'!$B$6:$B$21:'CETAK NOTA'!$B$1730:$B$1746,B427)","v":0},null,{"$f":"SUMIFS('CETAK NOTA'!$C$6:$C$21:'CETAK NOTA'!$C$1730:$C$1746,'CETAK NOTA'!$D$6:$D$21:'CETAK NOTA'!$D$1730:$D$1746,G427,'CETAK NOTA'!$B$6:$B$21:'CETAK NOTA'!$B$1730:$B$1746,B427)","v":0}]
[null,null,"",{"$f":"SUMIFS('CETAK NOTA'!$C$6:$C$21:'CETAK NOTA'!$C$1730:$C$1746,'CETAK NOTA'!$D$6:$D$21:'CETAK NOTA'!$D$1730:$D$1746,E428,'CETAK NOTA'!$B$6:$B$21:'CETAK NOTA'!$B$1730:$B$1746,B428)","v":0},null,{"$f":"SUMIFS('CETAK NOTA'!$C$6:$C$21:'CETAK NOTA'!$C$1730:$C$1746,'CETAK NOTA'!$D$6:$D$21:'CETAK NOTA'!$D$1730:$D$1746,G428,'CETAK NOTA'!$B$6:$B$21:'CETAK NOTA'!$B$1730:$B$1746,B428)","v":0}]
[null,null,"",{"$f":"SUMIFS('CETAK NOTA'!$C$6:$C$21:'CETAK NOTA'!$C$1730:$C$1746,'CETAK NOTA'!$D$6:$D$21:'CETAK NOTA'!$D$1730:$D$1746,E429,'CETAK NOTA'!$B$6:$B$21:'CETAK NOTA'!$B$1730:$B$1746,B429)","v":0},null,{"$f":"SUMIFS('CETAK NOTA'!$C$6:$C$21:'CETAK NOTA'!$C$1730:$C$1746,'CETAK NOTA'!$D$6:$D$21:'CETAK NOTA'!$D$1730:$D$1746,G429,'CETAK NOTA'!$B$6:$B$21:'CETAK NOTA'!$B$1730:$B$1746,B429)","v":0}]
[null,null,"",{"$f":"SUMIFS('CETAK NOTA'!$C$6:$C$21:'CETAK NOTA'!$C$1730:$C$1746,'CETAK NOTA'!$D$6:$D$21:'CETAK NOTA'!$D$1730:$D$1746,E430,'CETAK NOTA'!$B$6:$B$21:'CETAK NOTA'!$B$1730:$B$1746,B430)","v":0},null,{"$f":"SUMIFS('CETAK NOTA'!$C$6:$C$21:'CETAK NOTA'!$C$1730:$C$1746,'CETAK NOTA'!$D$6:$D$21:'CETAK NOTA'!$D$1730:$D$1746,G430,'CETAK NOTA'!$B$6:$B$21:'CETAK NOTA'!$B$1730:$B$1746,B430)","v":0}]
[null,null,"",{"$f":"SUMIFS('CETAK NOTA'!$C$6:$C$21:'CETAK NOTA'!$C$1730:$C$1746,'CETAK NOTA'!$D$6:$D$21:'CETAK NOTA'!$D$1730:$D$1746,E431,'CETAK NOTA'!$B$6:$B$21:'CETAK NOTA'!$B$1730:$B$1746,B431)","v":0},null,{"$f":"SUMIFS('CETAK NOTA'!$C$6:$C$21:'CETAK NOTA'!$C$1730:$C$1746,'CETAK NOTA'!$D$6:$D$21:'CETAK NOTA'!$D$1730:$D$1746,G431,'CETAK NOTA'!$B$6:$B$21:'CETAK NOTA'!$B$1730:$B$1746,B431)","v":0}]
[null,null,"",{"$f":"SUMIFS('CETAK NOTA'!$C$6:$C$21:'CETAK NOTA'!$C$1730:$C$1746,'CETAK NOTA'!$D$6:$D$21:'CETAK NOTA'!$D$1730:$D$1746,E432,'CETAK NOTA'!$B$6:$B$21:'CETAK NOTA'!$B$1730:$B$1746,B432)","v":0},null,{"$f":"SUMIFS('CETAK NOTA'!$C$6:$C$21:'CETAK NOTA'!$C$1730:$C$1746,'CETAK NOTA'!$D$6:$D$21:'CETAK NOTA'!$D$1730:$D$1746,G432,'CETAK NOTA'!$B$6:$B$21:'CETAK NOTA'!$B$1730:$B$1746,B432)","v":0}]
[null,null,"",{"$f":"SUMIFS('CETAK NOTA'!$C$6:$C$21:'CETAK NOTA'!$C$1730:$C$1746,'CETAK NOTA'!$D$6:$D$21:'CETAK NOTA'!$D$1730:$D$1746,E433,'CETAK NOTA'!$B$6:$B$21:'CETAK NOTA'!$B$1730:$B$1746,B433)","v":0},null,{"$f":"SUMIFS('CETAK NOTA'!$C$6:$C$21:'CETAK NOTA'!$C$1730:$C$1746,'CETAK NOTA'!$D$6:$D$21:'CETAK NOTA'!$D$1730:$D$1746,G433,'CETAK NOTA'!$B$6:$B$21:'CETAK NOTA'!$B$1730:$B$1746,B433)","v":0}]
[null,null,"",{"$f":"SUMIFS('CETAK NOTA'!$C$6:$C$21:'CETAK NOTA'!$C$1730:$C$1746,'CETAK NOTA'!$D$6:$D$21:'CETAK NOTA'!$D$1730:$D$1746,E434,'CETAK NOTA'!$B$6:$B$21:'CETAK NOTA'!$B$1730:$B$1746,B434)","v":0},null,{"$f":"SUMIFS('CETAK NOTA'!$C$6:$C$21:'CETAK NOTA'!$C$1730:$C$1746,'CETAK NOTA'!$D$6:$D$21:'CETAK NOTA'!$D$1730:$D$1746,G434,'CETAK NOTA'!$B$6:$B$21:'CETAK NOTA'!$B$1730:$B$1746,B434)","v":0}]
[null,null,"",{"$f":"SUMIFS('CETAK NOTA'!$C$6:$C$21:'CETAK NOTA'!$C$1730:$C$1746,'CETAK NOTA'!$D$6:$D$21:'CETAK NOTA'!$D$1730:$D$1746,E435,'CETAK NOTA'!$B$6:$B$21:'CETAK NOTA'!$B$1730:$B$1746,B435)","v":0},null,{"$f":"SUMIFS('CETAK NOTA'!$C$6:$C$21:'CETAK NOTA'!$C$1730:$C$1746,'CETAK NOTA'!$D$6:$D$21:'CETAK NOTA'!$D$1730:$D$1746,G435,'CETAK NOTA'!$B$6:$B$21:'CETAK NOTA'!$B$1730:$B$1746,B435)","v":0}]
[null,null,"",{"$f":"SUMIFS('CETAK NOTA'!$C$6:$C$21:'CETAK NOTA'!$C$1730:$C$1746,'CETAK NOTA'!$D$6:$D$21:'CETAK NOTA'!$D$1730:$D$1746,E436,'CETAK NOTA'!$B$6:$B$21:'CETAK NOTA'!$B$1730:$B$1746,B436)","v":0},null,{"$f":"SUMIFS('CETAK NOTA'!$C$6:$C$21:'CETAK NOTA'!$C$1730:$C$1746,'CETAK NOTA'!$D$6:$D$21:'CETAK NOTA'!$D$1730:$D$1746,G436,'CETAK NOTA'!$B$6:$B$21:'CETAK NOTA'!$B$1730:$B$1746,B436)","v":0}]
[null,null,"",{"$f":"SUMIFS('CETAK NOTA'!$C$6:$C$21:'CETAK NOTA'!$C$1730:$C$1746,'CETAK NOTA'!$D$6:$D$21:'CETAK NOTA'!$D$1730:$D$1746,E437,'CETAK NOTA'!$B$6:$B$21:'CETAK NOTA'!$B$1730:$B$1746,B437)","v":0},null,{"$f":"SUMIFS('CETAK NOTA'!$C$6:$C$21:'CETAK NOTA'!$C$1730:$C$1746,'CETAK NOTA'!$D$6:$D$21:'CETAK NOTA'!$D$1730:$D$1746,G437,'CETAK NOTA'!$B$6:$B$21:'CETAK NOTA'!$B$1730:$B$1746,B437)","v":0}]
[null,null,"",{"$f":"SUMIFS('CETAK NOTA'!$C$6:$C$21:'CETAK NOTA'!$C$1730:$C$1746,'CETAK NOTA'!$D$6:$D$21:'CETAK NOTA'!$D$1730:$D$1746,E438,'CETAK NOTA'!$B$6:$B$21:'CETAK NOTA'!$B$1730:$B$1746,B438)","v":0},null,{"$f":"SUMIFS('CETAK NOTA'!$C$6:$C$21:'CETAK NOTA'!$C$1730:$C$1746,'CETAK NOTA'!$D$6:$D$21:'CETAK NOTA'!$D$1730:$D$1746,G438,'CETAK NOTA'!$B$6:$B$21:'CETAK NOTA'!$B$1730:$B$1746,B438)","v":0}]
[null,null,"",{"$f":"SUMIFS('CETAK NOTA'!$C$6:$C$21:'CETAK NOTA'!$C$1730:$C$1746,'CETAK NOTA'!$D$6:$D$21:'CETAK NOTA'!$D$1730:$D$1746,E439,'CETAK NOTA'!$B$6:$B$21:'CETAK NOTA'!$B$1730:$B$1746,B439)","v":0},null,{"$f":"SUMIFS('CETAK NOTA'!$C$6:$C$21:'CETAK NOTA'!$C$1730:$C$1746,'CETAK NOTA'!$D$6:$D$21:'CETAK NOTA'!$D$1730:$D$1746,G439,'CETAK NOTA'!$B$6:$B$21:'CETAK NOTA'!$B$1730:$B$1746,B439)","v":0}]
[null,null,"",{"$f":"SUMIFS('CETAK NOTA'!$C$6:$C$21:'CETAK NOTA'!$C$1730:$C$1746,'CETAK NOTA'!$D$6:$D$21:'CETAK NOTA'!$D$1730:$D$1746,E440,'CETAK NOTA'!$B$6:$B$21:'CETAK NOTA'!$B$1730:$B$1746,B440)","v":0},null,{"$f":"SUMIFS('CETAK NOTA'!$C$6:$C$21:'CETAK NOTA'!$C$1730:$C$1746,'CETAK NOTA'!$D$6:$D$21:'CETAK NOTA'!$D$1730:$D$1746,G440,'CETAK NOTA'!$B$6:$B$21:'CETAK NOTA'!$B$1730:$B$1746,B440)","v":0}]
[null,null,"",{"$f":"SUMIFS('CETAK NOTA'!$C$6:$C$21:'CETAK NOTA'!$C$1730:$C$1746,'CETAK NOTA'!$D$6:$D$21:'CETAK NOTA'!$D$1730:$D$1746,E441,'CETAK NOTA'!$B$6:$B$21:'CETAK NOTA'!$B$1730:$B$1746,B441)","v":0},null,{"$f":"SUMIFS('CETAK NOTA'!$C$6:$C$21:'CETAK NOTA'!$C$1730:$C$1746,'CETAK NOTA'!$D$6:$D$21:'CETAK NOTA'!$D$1730:$D$1746,G441,'CETAK NOTA'!$B$6:$B$21:'CETAK NOTA'!$B$1730:$B$1746,B441)","v":0}]
[null,null,"",{"$f":"SUMIFS('CETAK NOTA'!$C$6:$C$21:'CETAK NOTA'!$C$1730:$C$1746,'CETAK NOTA'!$D$6:$D$21:'CETAK NOTA'!$D$1730:$D$1746,E442,'CETAK NOTA'!$B$6:$B$21:'CETAK NOTA'!$B$1730:$B$1746,B442)","v":0},null,{"$f":"SUMIFS('CETAK NOTA'!$C$6:$C$21:'CETAK NOTA'!$C$1730:$C$1746,'CETAK NOTA'!$D$6:$D$21:'CETAK NOTA'!$D$1730:$D$1746,G442,'CETAK NOTA'!$B$6:$B$21:'CETAK NOTA'!$B$1730:$B$1746,B442)","v":0}]
[null,null,"",{"$f":"SUMIFS('CETAK NOTA'!$C$6:$C$21:'CETAK NOTA'!$C$1730:$C$1746,'CETAK NOTA'!$D$6:$D$21:'CETAK NOTA'!$D$1730:$D$1746,E443,'CETAK NOTA'!$B$6:$B$21:'CETAK NOTA'!$B$1730:$B$1746,B443)","v":0},null,{"$f":"SUMIFS('CETAK NOTA'!$C$6:$C$21:'CETAK NOTA'!$C$1730:$C$1746,'CETAK NOTA'!$D$6:$D$21:'CETAK NOTA'!$D$1730:$D$1746,G443,'CETAK NOTA'!$B$6:$B$21:'CETAK NOTA'!$B$1730:$B$1746,B443)","v":0}]
[null,null,"",{"$f":"SUMIFS('CETAK NOTA'!$C$6:$C$21:'CETAK NOTA'!$C$1730:$C$1746,'CETAK NOTA'!$D$6:$D$21:'CETAK NOTA'!$D$1730:$D$1746,E444,'CETAK NOTA'!$B$6:$B$21:'CETAK NOTA'!$B$1730:$B$1746,B444)","v":0},null,{"$f":"SUMIFS('CETAK NOTA'!$C$6:$C$21:'CETAK NOTA'!$C$1730:$C$1746,'CETAK NOTA'!$D$6:$D$21:'CETAK NOTA'!$D$1730:$D$1746,G444,'CETAK NOTA'!$B$6:$B$21:'CETAK NOTA'!$B$1730:$B$1746,B444)","v":0}]
[null,null,"",{"$f":"SUMIFS('CETAK NOTA'!$C$6:$C$21:'CETAK NOTA'!$C$1730:$C$1746,'CETAK NOTA'!$D$6:$D$21:'CETAK NOTA'!$D$1730:$D$1746,E445,'CETAK NOTA'!$B$6:$B$21:'CETAK NOTA'!$B$1730:$B$1746,B445)","v":0},null,{"$f":"SUMIFS('CETAK NOTA'!$C$6:$C$21:'CETAK NOTA'!$C$1730:$C$1746,'CETAK NOTA'!$D$6:$D$21:'CETAK NOTA'!$D$1730:$D$1746,G445,'CETAK NOTA'!$B$6:$B$21:'CETAK NOTA'!$B$1730:$B$1746,B445)","v":0}]
[null,null,"",{"$f":"SUMIFS('CETAK NOTA'!$C$6:$C$21:'CETAK NOTA'!$C$1730:$C$1746,'CETAK NOTA'!$D$6:$D$21:'CETAK NOTA'!$D$1730:$D$1746,E446,'CETAK NOTA'!$B$6:$B$21:'CETAK NOTA'!$B$1730:$B$1746,B446)","v":0},null,{"$f":"SUMIFS('CETAK NOTA'!$C$6:$C$21:'CETAK NOTA'!$C$1730:$C$1746,'CETAK NOTA'!$D$6:$D$21:'CETAK NOTA'!$D$1730:$D$1746,G446,'CETAK NOTA'!$B$6:$B$21:'CETAK NOTA'!$B$1730:$B$1746,B446)","v":0}]
[null,null,"",{"$f":"SUMIFS('CETAK NOTA'!$C$6:$C$21:'CETAK NOTA'!$C$1730:$C$1746,'CETAK NOTA'!$D$6:$D$21:'CETAK NOTA'!$D$1730:$D$1746,E447,'CETAK NOTA'!$B$6:$B$21:'CETAK NOTA'!$B$1730:$B$1746,B447)","v":0},null,{"$f":"SUMIFS('CETAK NOTA'!$C$6:$C$21:'CETAK NOTA'!$C$1730:$C$1746,'CETAK NOTA'!$D$6:$D$21:'CETAK NOTA'!$D$1730:$D$1746,G447,'CETAK NOTA'!$B$6:$B$21:'CETAK NOTA'!$B$1730:$B$1746,B447)","v":0}]
[null,null,"",{"$f":"SUMIFS('CETAK NOTA'!$C$6:$C$21:'CETAK NOTA'!$C$1730:$C$1746,'CETAK NOTA'!$D$6:$D$21:'CETAK NOTA'!$D$1730:$D$1746,E448,'CETAK NOTA'!$B$6:$B$21:'CETAK NOTA'!$B$1730:$B$1746,B448)","v":0},null,{"$f":"SUMIFS('CETAK NOTA'!$C$6:$C$21:'CETAK NOTA'!$C$1730:$C$1746,'CETAK NOTA'!$D$6:$D$21:'CETAK NOTA'!$D$1730:$D$1746,G448,'CETAK NOTA'!$B$6:$B$21:'CETAK NOTA'!$B$1730:$B$1746,B448)","v":0}]
[null,null,"",{"$f":"SUMIFS('CETAK NOTA'!$C$6:$C$21:'CETAK NOTA'!$C$1730:$C$1746,'CETAK NOTA'!$D$6:$D$21:'CETAK NOTA'!$D$1730:$D$1746,E449,'CETAK NOTA'!$B$6:$B$21:'CETAK NOTA'!$B$1730:$B$1746,B449)","v":0},null,{"$f":"SUMIFS('CETAK NOTA'!$C$6:$C$21:'CETAK NOTA'!$C$1730:$C$1746,'CETAK NOTA'!$D$6:$D$21:'CETAK NOTA'!$D$1730:$D$1746,G449,'CETAK NOTA'!$B$6:$B$21:'CETAK NOTA'!$B$1730:$B$1746,B449)","v":0}]
[null,null,{"$f":"IF(AND(K450=0,L450=0),\"\",IF(AND(F450>0,K450>L450),\"RM\",\"TK\"))","v":""},{"$f":"SUMIFS('CETAK NOTA'!$C$6:$C$21:'CETAK NOTA'!$C$1730:$C$1746,'CETAK NOTA'!$D$6:$D$21:'CETAK NOTA'!$D$1730:$D$1746,E450,'CETAK NOTA'!$B$6:$B$21:'CETAK NOTA'!$B$1730:$B$1746,B450)","v":0},null,{"$f":"SUMIFS('CETAK NOTA'!$C$6:$C$21:'CETAK NOTA'!$C$1730:$C$1746,'CETAK NOTA'!$D$6:$D$21:'CETAK NOTA'!$D$1730:$D$1746,G450,'CETAK NOTA'!$B$6:$B$21:'CETAK NOTA'!$B$1730:$B$1746,B450)","v":0}]
[null,null,"",{"$f":"SUMIFS('CETAK NOTA'!$C$6:$C$21:'CETAK NOTA'!$C$1730:$C$1746,'CETAK NOTA'!$D$6:$D$21:'CETAK NOTA'!$D$1730:$D$1746,E451,'CETAK NOTA'!$B$6:$B$21:'CETAK NOTA'!$B$1730:$B$1746,B451)","v":0},null,{"$f":"SUMIFS('CETAK NOTA'!$C$6:$C$21:'CETAK NOTA'!$C$1730:$C$1746,'CETAK NOTA'!$D$6:$D$21:'CETAK NOTA'!$D$1730:$D$1746,G451,'CETAK NOTA'!$B$6:$B$21:'CETAK NOTA'!$B$1730:$B$1746,B451)","v":0}]
[null,null,"",{"$f":"SUMIFS('CETAK NOTA'!$C$6:$C$21:'CETAK NOTA'!$C$1730:$C$1746,'CETAK NOTA'!$D$6:$D$21:'CETAK NOTA'!$D$1730:$D$1746,E452,'CETAK NOTA'!$B$6:$B$21:'CETAK NOTA'!$B$1730:$B$1746,B452)","v":0},null,{"$f":"SUMIFS('CETAK NOTA'!$C$6:$C$21:'CETAK NOTA'!$C$1730:$C$1746,'CETAK NOTA'!$D$6:$D$21:'CETAK NOTA'!$D$1730:$D$1746,G452,'CETAK NOTA'!$B$6:$B$21:'CETAK NOTA'!$B$1730:$B$1746,B452)","v":0}]
[null,null,"",{"$f":"SUMIFS('CETAK NOTA'!$C$6:$C$21:'CETAK NOTA'!$C$1730:$C$1746,'CETAK NOTA'!$D$6:$D$21:'CETAK NOTA'!$D$1730:$D$1746,E453,'CETAK NOTA'!$B$6:$B$21:'CETAK NOTA'!$B$1730:$B$1746,B453)","v":0},null,{"$f":"SUMIFS('CETAK NOTA'!$C$6:$C$21:'CETAK NOTA'!$C$1730:$C$1746,'CETAK NOTA'!$D$6:$D$21:'CETAK NOTA'!$D$1730:$D$1746,G453,'CETAK NOTA'!$B$6:$B$21:'CETAK NOTA'!$B$1730:$B$1746,B453)","v":0}]
[null,null,"",{"$f":"SUMIFS('CETAK NOTA'!$C$6:$C$21:'CETAK NOTA'!$C$1730:$C$1746,'CETAK NOTA'!$D$6:$D$21:'CETAK NOTA'!$D$1730:$D$1746,E454,'CETAK NOTA'!$B$6:$B$21:'CETAK NOTA'!$B$1730:$B$1746,B454)","v":0},null,{"$f":"SUMIFS('CETAK NOTA'!$C$6:$C$21:'CETAK NOTA'!$C$1730:$C$1746,'CETAK NOTA'!$D$6:$D$21:'CETAK NOTA'!$D$1730:$D$1746,G454,'CETAK NOTA'!$B$6:$B$21:'CETAK NOTA'!$B$1730:$B$1746,B454)","v":0}]
[null,null,"",{"$f":"SUMIFS('CETAK NOTA'!$C$6:$C$21:'CETAK NOTA'!$C$1730:$C$1746,'CETAK NOTA'!$D$6:$D$21:'CETAK NOTA'!$D$1730:$D$1746,E455,'CETAK NOTA'!$B$6:$B$21:'CETAK NOTA'!$B$1730:$B$1746,B455)","v":0},null,{"$f":"SUMIFS('CETAK NOTA'!$C$6:$C$21:'CETAK NOTA'!$C$1730:$C$1746,'CETAK NOTA'!$D$6:$D$21:'CETAK NOTA'!$D$1730:$D$1746,G455,'CETAK NOTA'!$B$6:$B$21:'CETAK NOTA'!$B$1730:$B$1746,B455)","v":0}]
[null,null,null,{"$f":"SUMIFS('CETAK NOTA'!$C$6:$C$21:'CETAK NOTA'!$C$1730:$C$1746,'CETAK NOTA'!$D$6:$D$21:'CETAK NOTA'!$D$1730:$D$1746,E456,'CETAK NOTA'!$B$6:$B$21:'CETAK NOTA'!$B$1730:$B$1746,B456)","v":0},null,{"$f":"SUMIFS('CETAK NOTA'!$C$6:$C$21:'CETAK NOTA'!$C$1730:$C$1746,'CETAK NOTA'!$D$6:$D$21:'CETAK NOTA'!$D$1730:$D$1746,G456,'CETAK NOTA'!$B$6:$B$21:'CETAK NOTA'!$B$1730:$B$1746,B456)","v":0}]
[null,null,null,{"$f":"SUMIFS('CETAK NOTA'!$C$6:$C$21:'CETAK NOTA'!$C$1730:$C$1746,'CETAK NOTA'!$D$6:$D$21:'CETAK NOTA'!$D$1730:$D$1746,E457,'CETAK NOTA'!$B$6:$B$21:'CETAK NOTA'!$B$1730:$B$1746,B457)","v":0},null,{"$f":"SUMIFS('CETAK NOTA'!$C$6:$C$21:'CETAK NOTA'!$C$1730:$C$1746,'CETAK NOTA'!$D$6:$D$21:'CETAK NOTA'!$D$1730:$D$1746,G457,'CETAK NOTA'!$B$6:$B$21:'CETAK NOTA'!$B$1730:$B$1746,B457)","v":0}]
[null,null,null,{"$f":"SUMIFS('CETAK NOTA'!$C$6:$C$21:'CETAK NOTA'!$C$1730:$C$1746,'CETAK NOTA'!$D$6:$D$21:'CETAK NOTA'!$D$1730:$D$1746,E458,'CETAK NOTA'!$B$6:$B$21:'CETAK NOTA'!$B$1730:$B$1746,B458)","v":0},null,{"$f":"SUMIFS('CETAK NOTA'!$C$6:$C$21:'CETAK NOTA'!$C$1730:$C$1746,'CETAK NOTA'!$D$6:$D$21:'CETAK NOTA'!$D$1730:$D$1746,G458,'CETAK NOTA'!$B$6:$B$21:'CETAK NOTA'!$B$1730:$B$1746,B458)","v":0}]
[null,null,null,{"$f":"SUMIFS('CETAK NOTA'!$C$6:$C$21:'CETAK NOTA'!$C$1730:$C$1746,'CETAK NOTA'!$D$6:$D$21:'CETAK NOTA'!$D$1730:$D$1746,E459,'CETAK NOTA'!$B$6:$B$21:'CETAK NOTA'!$B$1730:$B$1746,B459)","v":0},null,{"$f":"SUMIFS('CETAK NOTA'!$C$6:$C$21:'CETAK NOTA'!$C$1730:$C$1746,'CETAK NOTA'!$D$6:$D$21:'CETAK NOTA'!$D$1730:$D$1746,G459,'CETAK NOTA'!$B$6:$B$21:'CETAK NOTA'!$B$1730:$B$1746,B459)","v":0}]
[null,null,null,{"$f":"SUMIFS('CETAK NOTA'!$C$6:$C$21:'CETAK NOTA'!$C$1730:$C$1746,'CETAK NOTA'!$D$6:$D$21:'CETAK NOTA'!$D$1730:$D$1746,E460,'CETAK NOTA'!$B$6:$B$21:'CETAK NOTA'!$B$1730:$B$1746,B460)","v":0},null,{"$f":"SUMIFS('CETAK NOTA'!$C$6:$C$21:'CETAK NOTA'!$C$1730:$C$1746,'CETAK NOTA'!$D$6:$D$21:'CETAK NOTA'!$D$1730:$D$1746,G460,'CETAK NOTA'!$B$6:$B$21:'CETAK NOTA'!$B$1730:$B$1746,B460)","v":0}]
[null,null,null,{"$f":"SUMIFS('CETAK NOTA'!$C$6:$C$21:'CETAK NOTA'!$C$1730:$C$1746,'CETAK NOTA'!$D$6:$D$21:'CETAK NOTA'!$D$1730:$D$1746,E461,'CETAK NOTA'!$B$6:$B$21:'CETAK NOTA'!$B$1730:$B$1746,B461)","v":0},null,{"$f":"SUMIFS('CETAK NOTA'!$C$6:$C$21:'CETAK NOTA'!$C$1730:$C$1746,'CETAK NOTA'!$D$6:$D$21:'CETAK NOTA'!$D$1730:$D$1746,G461,'CETAK NOTA'!$B$6:$B$21:'CETAK NOTA'!$B$1730:$B$1746,B461)","v":0}]
[null,null,null,{"$f":"SUMIFS('CETAK NOTA'!$C$6:$C$21:'CETAK NOTA'!$C$1730:$C$1746,'CETAK NOTA'!$D$6:$D$21:'CETAK NOTA'!$D$1730:$D$1746,E462,'CETAK NOTA'!$B$6:$B$21:'CETAK NOTA'!$B$1730:$B$1746,B462)","v":0},null,{"$f":"SUMIFS('CETAK NOTA'!$C$6:$C$21:'CETAK NOTA'!$C$1730:$C$1746,'CETAK NOTA'!$D$6:$D$21:'CETAK NOTA'!$D$1730:$D$1746,G462,'CETAK NOTA'!$B$6:$B$21:'CETAK NOTA'!$B$1730:$B$1746,B462)","v":0}]
[null,null,null,{"$f":"SUMIFS('CETAK NOTA'!$C$6:$C$21:'CETAK NOTA'!$C$1730:$C$1746,'CETAK NOTA'!$D$6:$D$21:'CETAK NOTA'!$D$1730:$D$1746,E463,'CETAK NOTA'!$B$6:$B$21:'CETAK NOTA'!$B$1730:$B$1746,B463)","v":0},null,{"$f":"SUMIFS('CETAK NOTA'!$C$6:$C$21:'CETAK NOTA'!$C$1730:$C$1746,'CETAK NOTA'!$D$6:$D$21:'CETAK NOTA'!$D$1730:$D$1746,G463,'CETAK NOTA'!$B$6:$B$21:'CETAK NOTA'!$B$1730:$B$1746,B463)","v":0}]
[null,null,null,{"$f":"SUMIFS('CETAK NOTA'!$C$6:$C$21:'CETAK NOTA'!$C$1730:$C$1746,'CETAK NOTA'!$D$6:$D$21:'CETAK NOTA'!$D$1730:$D$1746,E464,'CETAK NOTA'!$B$6:$B$21:'CETAK NOTA'!$B$1730:$B$1746,B464)","v":0},null,{"$f":"SUMIFS('CETAK NOTA'!$C$6:$C$21:'CETAK NOTA'!$C$1730:$C$1746,'CETAK NOTA'!$D$6:$D$21:'CETAK NOTA'!$D$1730:$D$1746,G464,'CETAK NOTA'!$B$6:$B$21:'CETAK NOTA'!$B$1730:$B$1746,B464)","v":0}]
[null,null,null,{"$f":"SUMIFS('CETAK NOTA'!$C$6:$C$21:'CETAK NOTA'!$C$1730:$C$1746,'CETAK NOTA'!$D$6:$D$21:'CETAK NOTA'!$D$1730:$D$1746,E465,'CETAK NOTA'!$B$6:$B$21:'CETAK NOTA'!$B$1730:$B$1746,B465)","v":0},null,{"$f":"SUMIFS('CETAK NOTA'!$C$6:$C$21:'CETAK NOTA'!$C$1730:$C$1746,'CETAK NOTA'!$D$6:$D$21:'CETAK NOTA'!$D$1730:$D$1746,G465,'CETAK NOTA'!$B$6:$B$21:'CETAK NOTA'!$B$1730:$B$1746,B465)","v":0}]
[null,null,null,{"$f":"SUMIFS('CETAK NOTA'!$C$6:$C$21:'CETAK NOTA'!$C$1730:$C$1746,'CETAK NOTA'!$D$6:$D$21:'CETAK NOTA'!$D$1730:$D$1746,E466,'CETAK NOTA'!$B$6:$B$21:'CETAK NOTA'!$B$1730:$B$1746,B466)","v":0},null,{"$f":"SUMIFS('CETAK NOTA'!$C$6:$C$21:'CETAK NOTA'!$C$1730:$C$1746,'CETAK NOTA'!$D$6:$D$21:'CETAK NOTA'!$D$1730:$D$1746,G466,'CETAK NOTA'!$B$6:$B$21:'CETAK NOTA'!$B$1730:$B$1746,B466)","v":0}]
[null,null,null,{"$f":"SUMIFS('CETAK NOTA'!$C$6:$C$21:'CETAK NOTA'!$C$1730:$C$1746,'CETAK NOTA'!$D$6:$D$21:'CETAK NOTA'!$D$1730:$D$1746,E467,'CETAK NOTA'!$B$6:$B$21:'CETAK NOTA'!$B$1730:$B$1746,B467)","v":0},null,{"$f":"SUMIFS('CETAK NOTA'!$C$6:$C$21:'CETAK NOTA'!$C$1730:$C$1746,'CETAK NOTA'!$D$6:$D$21:'CETAK NOTA'!$D$1730:$D$1746,G467,'CETAK NOTA'!$B$6:$B$21:'CETAK NOTA'!$B$1730:$B$1746,B467)","v":0}]
[null,null,null,{"$f":"SUMIFS('CETAK NOTA'!$C$6:$C$21:'CETAK NOTA'!$C$1730:$C$1746,'CETAK NOTA'!$D$6:$D$21:'CETAK NOTA'!$D$1730:$D$1746,E468,'CETAK NOTA'!$B$6:$B$21:'CETAK NOTA'!$B$1730:$B$1746,B468)","v":0},null,{"$f":"SUMIFS('CETAK NOTA'!$C$6:$C$21:'CETAK NOTA'!$C$1730:$C$1746,'CETAK NOTA'!$D$6:$D$21:'CETAK NOTA'!$D$1730:$D$1746,G468,'CETAK NOTA'!$B$6:$B$21:'CETAK NOTA'!$B$1730:$B$1746,B468)","v":0}]
[null,null,null,{"$f":"SUMIFS('CETAK NOTA'!$C$6:$C$21:'CETAK NOTA'!$C$1730:$C$1746,'CETAK NOTA'!$D$6:$D$21:'CETAK NOTA'!$D$1730:$D$1746,E469,'CETAK NOTA'!$B$6:$B$21:'CETAK NOTA'!$B$1730:$B$1746,B469)","v":0},null,{"$f":"SUMIFS('CETAK NOTA'!$C$6:$C$21:'CETAK NOTA'!$C$1730:$C$1746,'CETAK NOTA'!$D$6:$D$21:'CETAK NOTA'!$D$1730:$D$1746,G469,'CETAK NOTA'!$B$6:$B$21:'CETAK NOTA'!$B$1730:$B$1746,B469)","v":0}]
[null,null,null,{"$f":"SUMIFS('CETAK NOTA'!$C$6:$C$21:'CETAK NOTA'!$C$1730:$C$1746,'CETAK NOTA'!$D$6:$D$21:'CETAK NOTA'!$D$1730:$D$1746,E470,'CETAK NOTA'!$B$6:$B$21:'CETAK NOTA'!$B$1730:$B$1746,B470)","v":0},null,{"$f":"SUMIFS('CETAK NOTA'!$C$6:$C$21:'CETAK NOTA'!$C$1730:$C$1746,'CETAK NOTA'!$D$6:$D$21:'CETAK NOTA'!$D$1730:$D$1746,G470,'CETAK NOTA'!$B$6:$B$21:'CETAK NOTA'!$B$1730:$B$1746,B470)","v":0}]
[null,null,null,{"$f":"SUMIFS('CETAK NOTA'!$C$6:$C$21:'CETAK NOTA'!$C$1730:$C$1746,'CETAK NOTA'!$D$6:$D$21:'CETAK NOTA'!$D$1730:$D$1746,E471,'CETAK NOTA'!$B$6:$B$21:'CETAK NOTA'!$B$1730:$B$1746,B471)","v":0},null,{"$f":"SUMIFS('CETAK NOTA'!$C$6:$C$21:'CETAK NOTA'!$C$1730:$C$1746,'CETAK NOTA'!$D$6:$D$21:'CETAK NOTA'!$D$1730:$D$1746,G471,'CETAK NOTA'!$B$6:$B$21:'CETAK NOTA'!$B$1730:$B$1746,B471)","v":0}]
[null,null,null,{"$f":"SUMIFS('CETAK NOTA'!$C$6:$C$21:'CETAK NOTA'!$C$1730:$C$1746,'CETAK NOTA'!$D$6:$D$21:'CETAK NOTA'!$D$1730:$D$1746,E472,'CETAK NOTA'!$B$6:$B$21:'CETAK NOTA'!$B$1730:$B$1746,B472)","v":0},null,{"$f":"SUMIFS('CETAK NOTA'!$C$6:$C$21:'CETAK NOTA'!$C$1730:$C$1746,'CETAK NOTA'!$D$6:$D$21:'CETAK NOTA'!$D$1730:$D$1746,G472,'CETAK NOTA'!$B$6:$B$21:'CETAK NOTA'!$B$1730:$B$1746,B472)","v":0}]
[null,null,null,{"$f":"SUMIFS('CETAK NOTA'!$C$6:$C$21:'CETAK NOTA'!$C$1730:$C$1746,'CETAK NOTA'!$D$6:$D$21:'CETAK NOTA'!$D$1730:$D$1746,E473,'CETAK NOTA'!$B$6:$B$21:'CETAK NOTA'!$B$1730:$B$1746,B473)","v":0},null,{"$f":"SUMIFS('CETAK NOTA'!$C$6:$C$21:'CETAK NOTA'!$C$1730:$C$1746,'CETAK NOTA'!$D$6:$D$21:'CETAK NOTA'!$D$1730:$D$1746,G473,'CETAK NOTA'!$B$6:$B$21:'CETAK NOTA'!$B$1730:$B$1746,B473)","v":0}]

{"sheet":"PRICELIST","index":3,"n_rows":8,"n_cols":13,"rows_kept":8,"cut":false,"hidden":false,"merged":[]}
["CODE","ALL ITEM","CODE","PRICE","UNIT","Q","HARGA PCS","MODAL PCS","MODAL DOS","PRICELIST","NO","NAMA","KOTA"]
[1,"BUKU TULIS",1,582000,"DOS",20,{"$f":"D2/F2","v":29100},{"$f":"I2/F2","v":26631},{"$f":"J2-(J2*9%)+3000","v":532620},582000,1,"SUMBER SUKSES","JATIARUM"]
[2,"PENSIL",2,655800,"DOS",6,{"$f":"D3/F3","v":109300},{"$f":"I3/F3","v":100509.5},{"$f":"J3-(J3*8.5%)+3000","v":603057},655800,2,"SUMBER MAKMUR","JATIROTO"]
[3,"PENGGARIS",3,532000,"DOS",4,133000,123775,{"$f":"J4-(J4*7.5%)+3000","v":495100},532000,3,"SUMBER HIDUP","JATIMANUNGGAL"]
[4,"PENGHAPUS",4,529000,"DOS",2,264500,246162.5,{"$f":"J5-(J5*7.5%)+3000","v":492325},529000]
[5,"BOLPOIN",5,518000,"DOS",20,25900,23848.5,{"$f":"J6-(J6*8.5%)+3000","v":476970},518000]
[6,"STAPLER",6,570600,"DOS",6,95100,87041,{"$f":"J7-(J7*9%)+3000","v":522246},570600]
[7,"ISOLASI",7,612000,"DOS",20,30600,27843,{"$f":"J8-(J8*9.5%)+3000","v":556860},612000]