{"text_format":"1","workbook":"xlsx","n_sheets":3,"sheets":["Laporan","Database","db_customer"],"not_rendered":{"charts":0,"images":0,"macros":1,"external_links":0,"defined_names":1,"comments":0,"pivot_tables":0},"unopened":[],"bounds":{"document_bytes":16777216,"sheet_cells":100000,"rows_first":2000,"rows_last":500,"rows_between":2000,"halvings":0,"cell_chars":16384,"cell_head_chars":4096},"cells_cut":0,"cells_raw":0,"read":"whole","date_system":"1900"}

{"sheet":"Laporan","index":0,"n_rows":0,"n_cols":0,"rows_kept":0,"cut":false,"hidden":false,"merged":[]}

{"sheet":"Database","index":1,"n_rows":130,"n_cols":16,"rows_kept":130,"cut":false,"hidden":false,"merged":[]}
["Company","Project Name","Customer No","Client Name","Penagihan/Pembayaran","Deskripsi","Invoice No","Date","Month","Year","Due Date","Days Outstanding","Status","Principal USD","Vat USD","Gross USD"]
[12,"Jaksel",600190,"PT CDE","Penagihan","Listrik",17011043,"2017-01-24",{"$f":"IFERROR(VLOOKUP(MONTH(H2),db_customer!$A$18:$B$29,2,FALSE),\"\")","v":"January"},{"$f":"IF(H2=\"\",\"\",YEAR(H2))","v":2017},{"$f":"H2+30","v":"2017-02-23"},null,null,677953.81242002256,{"$f":"N2*10%","v":67795.381242002259},{"$f":"SUM(N2:O2)","v":745749.1936620248}]
[12,"Jaksel",600190,"PT CDE","Penagihan","Listrik",17011062,"2017-02-14",{"$f":"IFERROR(VLOOKUP(MONTH(H3),db_customer!$A$18:$B$29,2,FALSE),\"\")","v":"February"},2017,"2017-03-16",null,null,944444.21476761624,{"$f":"N3*10%","v":94444.421476761636},{"$f":"SUM(N3:O3)","v":1038888.6362443778}]
[12,"Jaksel",600190,"PT CDE","Penagihan","Listrik",17011093,"2017-02-20",{"$f":"IFERROR(VLOOKUP(MONTH(H4),db_customer!$A$18:$B$29,2,FALSE),\"\")","v":"February"},2017,"2017-03-22",null,null,1589760.5187406298,158976.05187406298,1748736.5706146928]
[12,"Jaksel",600190,"PT CDE","Penagihan","Listrik",17011118,"2017-03-08",{"$f":"IFERROR(VLOOKUP(MONTH(H5),db_customer!$A$18:$B$29,2,FALSE),\"\")","v":"March"},2017,"2017-04-07",null,null,1784973.3614854747,178497.33614854747,1963470.6976340222]
[12,"Jaksel",600190,"PT CDE","Penagihan","Listrik",17011151,"2017-03-22",{"$f":"IFERROR(VLOOKUP(MONTH(H6),db_customer!$A$18:$B$29,2,FALSE),\"\")","v":"March"},2017,"2017-04-21",null,null,632486.67325546569,63248.667325546572,695735.34058101231]
[12,"Jaksel",600190,"PT CDE","Penagihan","Listrik",17011202,"2017-04-26",{"$f":"IFERROR(VLOOKUP(MONTH(H7),db_customer!$A$18:$B$29,2,FALSE),\"\")","v":"April"},2017,"2017-05-26",null,null,1412748.100510051,141274.8100510051,1554022.9105610561]
[12,"Jaksel",600190,"PT CDE","Penagihan","Listrik",17011221,"2017-05-17",{"$f":"IFERROR(VLOOKUP(MONTH(H8),db_customer!$A$18:$B$29,2,FALSE),\"\")","v":"May"},2017,"2017-06-16",null,null,482393.13849977404,48239.313849977407,530632.45234975149]
[12,"Jaksel",600190,"PT CDE","Penagihan","Listrik",17011222,"2017-05-17",{"$f":"IFERROR(VLOOKUP(MONTH(H9),db_customer!$A$18:$B$29,2,FALSE),\"\")","v":"May"},2017,"2017-06-16",null,null,1973387.0390872119,197338.70390872122,2170725.7429959332]
[12,"Jaksel",600190,"PT CDE","Penagihan","Listrik",17011240,"2017-05-26",{"$f":"IFERROR(VLOOKUP(MONTH(H10),db_customer!$A$18:$B$29,2,FALSE),\"\")","v":"May"},2017,"2017-06-25",null,null,1319078.9585027865,131907.89585027864,1450986.8543530651]
[12,"Jaksel",600190,"PT CDE","Penagihan","Listrik",17011246,"2017-06-09",{"$f":"IFERROR(VLOOKUP(MONTH(H11),db_customer!$A$18:$B$29,2,FALSE),\"\")","v":"June"},2017,"2017-07-09",null,null,1213339.29,121333.929,1334673.219]
[12,"Jaksel",600190,"PT CDE","Penagihan","Gas",17011292,"2017-06-27",{"$f":"IFERROR(VLOOKUP(MONTH(H12),db_customer!$A$18:$B$29,2,FALSE),\"\")","v":"June"},2017,"2017-07-27",null,null,1394665.82,139466.58200000002,1534132.402]
[12,"Jaksel",600190,"PT CDE","Penagihan","Gas",17011293,"2017-07-11",{"$f":"IFERROR(VLOOKUP(MONTH(H13),db_customer!$A$18:$B$29,2,FALSE),\"\")","v":"July"},2017,"2017-08-10",null,null,435767.84,43576.784000000007,479344.62400000001]
[12,"Jaksel",600190,"PT CDE","Penagihan","Gas",17011325,"2017-07-26",{"$f":"IFERROR(VLOOKUP(MONTH(H14),db_customer!$A$18:$B$29,2,FALSE),\"\")","v":"July"},2017,"2017-08-25",null,null,598364.42000000004,59836.44200000001,658200.86200000008]
[12,"Jaksel",600190,"PT CDE","Penagihan","Gas",17011344,"2017-08-08",{"$f":"IFERROR(VLOOKUP(MONTH(H15),db_customer!$A$18:$B$29,2,FALSE),\"\")","v":"August"},2017,"2017-09-07",null,null,1246470.6274186291,124647.06274186292,1371117.690160492]
[12,"Jaksel",600190,"PT CDE","Penagihan","Gas",17011392,"2017-08-23",{"$f":"IFERROR(VLOOKUP(MONTH(H16),db_customer!$A$18:$B$29,2,FALSE),\"\")","v":"August"},2017,"2017-09-22",null,null,1136861.2423878806,113686.12423878806,1250547.3666266687]
[12,"Jaksel",600190,"PT CDE","Penagihan","Air",17011430,"2017-09-25",{"$f":"IFERROR(VLOOKUP(MONTH(H17),db_customer!$A$18:$B$29,2,FALSE),\"\")","v":"September"},2017,"2017-10-25",null,null,1239898,123989.8,1363887.8]
[12,"Jaksel",600190,"PT CDE","Penagihan","Air",17011431,"2017-09-25",{"$f":"IFERROR(VLOOKUP(MONTH(H18),db_customer!$A$18:$B$29,2,FALSE),\"\")","v":"September"},2017,"2017-10-25",null,null,1437579,143757.9,1581336.9]
[12,"Jaksel",600190,"PT CDE","Penagihan","Air",17011468,"2017-10-17",{"$f":"IFERROR(VLOOKUP(MONTH(H19),db_customer!$A$18:$B$29,2,FALSE),\"\")","v":"October"},2017,"2017-11-16",null,null,2424151.89,242415.18900000001,2666567.0789999999]
[12,"Jaksel",600190,"PT CDE","Penagihan","Air",17011476,"2017-10-25",{"$f":"IFERROR(VLOOKUP(MONTH(H20),db_customer!$A$18:$B$29,2,FALSE),\"\")","v":"October"},2017,"2017-11-24",null,null,2836613.9033911079,283661.3903391108,3120275.2937302189]
[12,"Jaksel",600190,"PT CDE","Penagihan","Air",17011514,"2017-11-17",{"$f":"IFERROR(VLOOKUP(MONTH(H21),db_customer!$A$18:$B$29,2,FALSE),\"\")","v":"November"},2017,"2017-12-17",null,null,2757355.22,275735.52200000006,3033090.7420000001]
[12,"Jaksel",600190,"PT CDE","Penagihan","Air",17011521,"2017-11-28",{"$f":"IFERROR(VLOOKUP(MONTH(H22),db_customer!$A$18:$B$29,2,FALSE),\"\")","v":"November"},2017,"2017-12-28",null,null,3037439.81,null,3037439.81]
[12,"Tanggerang",600190,"Pt OPQ","Pembayaran",null,16010698,"2017-03-13",{"$f":"IFERROR(VLOOKUP(MONTH(H23),db_customer!$A$18:$B$29,2,FALSE),\"\")","v":"March"},2017,null,null,null,null,{"$f":"N23*10%","v":0},{"$f":"SUM(N23:O23)","v":0}]
[12,"Jaksel",600190,"PT CDE","Pembayaran",null,17011043,"2017-03-13",{"$f":"IFERROR(VLOOKUP(MONTH(H24),db_customer!$A$18:$B$29,2,FALSE),\"\")","v":"March"},2017,null,null,null,-677953.81,-67795.381000000008,-745749.19100000011]
[12,"Jaksel",600190,"PT CDE","Pembayaran",null,17011062,"2017-03-13",{"$f":"IFERROR(VLOOKUP(MONTH(H25),db_customer!$A$18:$B$29,2,FALSE),\"\")","v":"March"},2017,null,null,null,-66145.45,-6614.5450000000001,-72759.994999999995]
[12,"Jaksel",600190,"PT CDE","Pembayaran",null,17011062,"2017-03-20",{"$f":"IFERROR(VLOOKUP(MONTH(H26),db_customer!$A$18:$B$29,2,FALSE),\"\")","v":"March"},2017,null,null,null,-878298.76,-87829.876000000004,-966128.63600000006]
[12,"Jaksel",600190,"PT CDE","Pembayaran",null,17011093,"2017-03-20",{"$f":"IFERROR(VLOOKUP(MONTH(H27),db_customer!$A$18:$B$29,2,FALSE),\"\")","v":"March"},2017,null,null,null,-82952.31,-8295.2309999999998,-91247.540999999997]
[12,"Jaksel",600190,"PT CDE","Pembayaran",null,17011093,"2017-03-30",{"$f":"IFERROR(VLOOKUP(MONTH(H28),db_customer!$A$18:$B$29,2,FALSE),\"\")","v":"March"},2017,null,null,null,-735527.19,-73552.718999999997,-809079.90899999999]
[12,"Jaksel",600190,"PT CDE","Pembayaran",null,17011093,"2017-04-26",{"$f":"IFERROR(VLOOKUP(MONTH(H29),db_customer!$A$18:$B$29,2,FALSE),\"\")","v":"April"},2017,null,null,null,-684956.97,-68495.697,-753452.66700000002]
[12,"Jaksel",600190,"PT CDE","Pembayaran",null,17011093,"2017-05-02",{"$f":"IFERROR(VLOOKUP(MONTH(H30),db_customer!$A$18:$B$29,2,FALSE),\"\")","v":"May"},2017,null,null,null,-37766.94,-3776.6940000000004,-41543.634000000005]
[12,"Jaksel",600190,"PT CDE","Pembayaran",null,17011093,"2017-05-12",{"$f":"IFERROR(VLOOKUP(MONTH(H31),db_customer!$A$18:$B$29,2,FALSE),\"\")","v":"May"},2017,null,null,null,-48557.1,-4855.71,-53412.81]
[12,"Jaksel",600190,"PT CDE","Pembayaran",null,17011118,"2017-05-12",{"$f":"IFERROR(VLOOKUP(MONTH(H32),db_customer!$A$18:$B$29,2,FALSE),\"\")","v":"May"},2017,null,null,null,-323613.63,-32361.363000000001,-355974.99300000002]
[12,"Jaksel",600190,"PT CDE","Pembayaran",null,17011118,"2017-05-19",{"$f":"IFERROR(VLOOKUP(MONTH(H33),db_customer!$A$18:$B$29,2,FALSE),\"\")","v":"May"},2017,null,null,null,-1144995.45,-114499.545,-1259494.9949999999]
[12,"Jaksel",600190,"PT CDE","Pembayaran",null,17011118,"2017-05-30",{"$f":"IFERROR(VLOOKUP(MONTH(H34),db_customer!$A$18:$B$29,2,FALSE),\"\")","v":"May"},{"$f":"IF(H34=\"\",\"\",YEAR(H34))","v":2017},null,null,null,-316364.28000000003,-31636.428000000004,-348000.70800000004]
[12,"Jaksel",600190,"PT CDE","Pembayaran",null,17011151,"2017-05-30",{"$f":"IFERROR(VLOOKUP(MONTH(H35),db_customer!$A$18:$B$29,2,FALSE),\"\")","v":"May"},2017,null,null,null,-632486.67000000004,-63248.667000000009,-695735.33700000006]
[12,"Jaksel",600190,"PT CDE","Pembayaran",null,17011202,"2017-05-30",{"$f":"IFERROR(VLOOKUP(MONTH(H36),db_customer!$A$18:$B$29,2,FALSE),\"\")","v":"May"},2017,null,null,null,-692310.31,-69231.031000000003,-761541.34100000001]
[12,"Jaksel",600190,"PT CDE","Pembayaran",null,17011202,"2017-06-06",{"$f":"IFERROR(VLOOKUP(MONTH(H37),db_customer!$A$18:$B$29,2,FALSE),\"\")","v":"June"},2017,null,null,null,-390227.86,-39022.786,-429250.64600000001]
[12,"Jaksel",600190,"PT CDE","Pembayaran",null,17011202,"2017-07-14",{"$f":"IFERROR(VLOOKUP(MONTH(H38),db_customer!$A$18:$B$29,2,FALSE),\"\")","v":"July"},2017,null,null,null,-330209.91999999998,-33020.991999999998,-363230.91200000001]
[12,"Jaksel",600190,"PT CDE","Pembayaran",null,17011221,"2017-07-14",{"$f":"IFERROR(VLOOKUP(MONTH(H39),db_customer!$A$18:$B$29,2,FALSE),\"\")","v":"July"},2017,null,null,null,-3169.58,-316.95800000000003,-3486.538]
[12,"Jaksel",600190,"PT CDE","Pembayaran",null,17011221,"2017-07-24",{"$f":"IFERROR(VLOOKUP(MONTH(H40),db_customer!$A$18:$B$29,2,FALSE),\"\")","v":"July"},2017,null,null,null,-479223.55,-47922.355000000003,-527145.90500000003]
[12,"Jaksel",600190,"PT CDE","Pembayaran",null,17011222,"2017-07-24",{"$f":"IFERROR(VLOOKUP(MONTH(H41),db_customer!$A$18:$B$29,2,FALSE),\"\")","v":"July"},2017,null,null,null,-683813.78,-68381.378000000012,-752195.15800000005]
[12,"Jaksel",600190,"PT CDE","Pembayaran",null,17011222,"2017-08-03",{"$f":"IFERROR(VLOOKUP(MONTH(H42),db_customer!$A$18:$B$29,2,FALSE),\"\")","v":"August"},2017,null,null,null,-1289573.26,-128957.326,-1418530.5860000001]
[12,"Jaksel",600190,"PT CDE","Pembayaran",null,17011246,"2017-08-03",{"$f":"IFERROR(VLOOKUP(MONTH(H43),db_customer!$A$18:$B$29,2,FALSE),\"\")","v":"August"},2017,null,null,null,-37000.199999999997,-3700.02,-40700.219999999994]
[12,"Jaksel",600190,"PT CDE","Pembayaran",null,17011246,"2017-08-18",{"$f":"IFERROR(VLOOKUP(MONTH(H44),db_customer!$A$18:$B$29,2,FALSE),\"\")","v":"August"},2017,null,null,null,-108585.22,-10858.522000000001,-119443.742]
[12,"Jaksel",600190,"PT CDE","Pembayaran",null,17011246,"2017-09-06",{"$f":"IFERROR(VLOOKUP(MONTH(H45),db_customer!$A$18:$B$29,2,FALSE),\"\")","v":"September"},2017,null,null,null,-1067753.8700000001,-106775.38700000002,-1174529.2570000002]
[12,"Jaksel",600190,"PT CDE","Pembayaran",null,17011292,"2017-09-06",{"$f":"IFERROR(VLOOKUP(MONTH(H46),db_customer!$A$18:$B$29,2,FALSE),\"\")","v":"September"},2017,null,null,null,-363360.67,-36336.067000000003,-399696.73699999996]
[12,"Jaksel",600190,"PT CDE","Pembayaran",null,17011292,"2017-09-20",{"$f":"IFERROR(VLOOKUP(MONTH(H47),db_customer!$A$18:$B$29,2,FALSE),\"\")","v":"September"},2017,null,null,null,-200698.62,-20069.862000000001,-220768.48199999999]
[12,"Jaksel",600190,"PT CDE","Pembayaran",null,17011292,"2017-09-20",{"$f":"IFERROR(VLOOKUP(MONTH(H48),db_customer!$A$18:$B$29,2,FALSE),\"\")","v":"September"},2017,null,null,null,830606.53,83060.653000000006,913667.18300000008]
[12,"Jaksel",600190,"PT CDE","Pembayaran",null,17011293,"2017-09-20",{"$f":"IFERROR(VLOOKUP(MONTH(H49),db_customer!$A$18:$B$29,2,FALSE),\"\")","v":"September"},2017,null,null,null,-65326.81,-6532.6810000000005,-71859.490999999995]
[12,"Jaksel",600190,"PT CDE","Pembayaran",null,17011293,"2017-10-04",{"$f":"IFERROR(VLOOKUP(MONTH(H50),db_customer!$A$18:$B$29,2,FALSE),\"\")","v":"October"},2017,null,null,null,-370441.03,-37044.103000000003,-407485.13300000003]
[12,"Jaksel",600190,"PT CDE","Pembayaran",null,17011325,"2017-10-04",{"$f":"IFERROR(VLOOKUP(MONTH(H51),db_customer!$A$18:$B$29,2,FALSE),\"\")","v":"October"},2017,null,null,null,-598364.42000000004,-59836.44200000001,-658200.86200000008]
[12,"Jaksel",600190,"PT CDE","Pembayaran",null,17011344,"2017-10-04",{"$f":"IFERROR(VLOOKUP(MONTH(H52),db_customer!$A$18:$B$29,2,FALSE),\"\")","v":"October"},2017,null,null,null,-225732.48000000001,-22573.248000000003,-248305.728]
[12,"Jaksel",600190,"PT CDE","Pembayaran",null,17011344,"2017-10-20",{"$f":"IFERROR(VLOOKUP(MONTH(H53),db_customer!$A$18:$B$29,2,FALSE),\"\")","v":"October"},2017,null,null,null,-417607.25,-41760.725000000006,-459367.97499999998]
[12,"Jaksel",600190,"PT CDE","Pembayaran",null,17011344,"2017-10-25",{"$f":"IFERROR(VLOOKUP(MONTH(H54),db_customer!$A$18:$B$29,2,FALSE),\"\")","v":"October"},2017,null,null,null,-603130.9,-60313.090000000004,-663443.99]
[12,"Jaksel",600190,"PT CDE","Pembayaran",null,17011329,"2017-10-25",{"$f":"IFERROR(VLOOKUP(MONTH(H55),db_customer!$A$18:$B$29,2,FALSE),\"\")","v":"October"},2017,null,null,null,-688108.72,-68810.872000000003,-756919.59199999995]
[12,"Jaksel",600190,"PT CDE","Pembayaran",null,17011329,"2017-11-01",{"$f":"IFERROR(VLOOKUP(MONTH(H56),db_customer!$A$18:$B$29,2,FALSE),\"\")","v":"November"},2017,null,null,null,-448752.52,-44875.252000000008,-493627.772]
[12,"Jaksel",600190,"PT CDE","Pembayaran",null,17011430,"2017-11-10",{"$f":"IFERROR(VLOOKUP(MONTH(H57),db_customer!$A$18:$B$29,2,FALSE),\"\")","v":"November"},2017,null,null,null,-476207.81,-47620.781000000003,-523828.59100000001]
[12,"Jaksel",600190,"PT CDE","Pembayaran",null,17011430,"2017-11-10",{"$f":"IFERROR(VLOOKUP(MONTH(H58),db_customer!$A$18:$B$29,2,FALSE),\"\")","v":"November"},2017,null,null,null,-763690,-76369,-840059]
[12,"Jaksel",600190,"PT CDE","Pembayaran",null,17011431,"2017-11-10",{"$f":"IFERROR(VLOOKUP(MONTH(H59),db_customer!$A$18:$B$29,2,FALSE),\"\")","v":"November"},2017,null,null,null,-295156.3,-29515.63,-324671.93]
[12,"Jaksel",600190,"PT CDE","Pembayaran",null,17011431,"2017-11-16",{"$f":"IFERROR(VLOOKUP(MONTH(H60),db_customer!$A$18:$B$29,2,FALSE),\"\")","v":"November"},2017,null,null,null,-817568.98,-81756.898000000001,-899325.87800000003]
[12,"Jakut",138111,"PT HIJ","Penagihan","Iuran",17011008,"2017-01-13",{"$f":"IFERROR(VLOOKUP(MONTH(H61),db_customer!$A$18:$B$29,2,FALSE),\"\")","v":"January"},2017,null,null,null,951720.05,{"$f":"N61*10%","v":95172.005000000005},{"$f":"SUM(N61:O61)","v":1046892.0550000001}]
[12,"Jakut",138111,"PT HIJ","Penagihan","Iuran",17011064,"2017-02-14",{"$f":"IFERROR(VLOOKUP(MONTH(H62),db_customer!$A$18:$B$29,2,FALSE),\"\")","v":"February"},2017,null,null,null,3686172.43,368617.24300000002,4054789.6730000004]
[12,"Jakut",138111,"PT HIJ","Penagihan","Iuran",17011125,"2017-03-13",{"$f":"IFERROR(VLOOKUP(MONTH(H63),db_customer!$A$18:$B$29,2,FALSE),\"\")","v":"March"},2017,null,null,null,4535185.3,453518.53,4988703.83]
[12,"Jakut",138111,"PT HIJ","Penagihan","Iuran",17011169,"2017-04-12",{"$f":"IFERROR(VLOOKUP(MONTH(H64),db_customer!$A$18:$B$29,2,FALSE),\"\")","v":"April"},2017,null,null,null,4596474.2,459647.42000000004,5056121.62]
[12,"Jakut",138111,"PT HIJ","Penagihan","Iuran",17011209,"2017-05-12",{"$f":"IFERROR(VLOOKUP(MONTH(H65),db_customer!$A$18:$B$29,2,FALSE),\"\")","v":"May"},2017,null,null,null,2512178.2799999998,251217.82799999998,2763396.108]
[12,"Jakut",138111,"PT HIJ","Penagihan","Iuran",17011253,"2017-06-12",{"$f":"IFERROR(VLOOKUP(MONTH(H66),db_customer!$A$18:$B$29,2,FALSE),\"\")","v":"June"},{"$f":"IF(H66=\"\",\"\",YEAR(H66))","v":2017},null,null,null,2228784.2999999998,222878.43,2451662.73]
[12,"Jakut",138111,"PT HIJ","Penagihan","Iuran",17011306,"2017-07-19",{"$f":"IFERROR(VLOOKUP(MONTH(H67),db_customer!$A$18:$B$29,2,FALSE),\"\")","v":"July"},2017,null,null,null,1560269,156026.9,1716295.9]
[12,"Jakut",138111,"PT HIJ","Penagihan","Iuran",17011357,"2017-08-11",{"$f":"IFERROR(VLOOKUP(MONTH(H68),db_customer!$A$18:$B$29,2,FALSE),\"\")","v":"August"},2017,null,null,null,3226308,322630.80000000005,3548938.8]
[12,"Jakut",138111,"PT HIJ","Penagihan","Iuran",17011406,"2017-09-12",{"$f":"IFERROR(VLOOKUP(MONTH(H69),db_customer!$A$18:$B$29,2,FALSE),\"\")","v":"September"},2017,null,null,null,4175429,417542.9,4592971.9000000004]
[12,"Jakut",138111,"PT HIJ","Penagihan","Iuran",17011450,"2017-10-12",{"$f":"IFERROR(VLOOKUP(MONTH(H70),db_customer!$A$18:$B$29,2,FALSE),\"\")","v":"October"},2017,null,null,null,6507584.0599999996,650758.40599999996,7158342.466]
[12,"Jakut",138111,"PT HIJ","Penagihan","Iuran",17011500,"2017-11-13",{"$f":"IFERROR(VLOOKUP(MONTH(H71),db_customer!$A$18:$B$29,2,FALSE),\"\")","v":"November"},2017,null,null,null,8738597,873859.70000000007,9612456.6999999993]
[12,"Jatim",138113,"PT KLM","Penagihan","Iuran",17011007,"2017-01-13",{"$f":"IFERROR(VLOOKUP(MONTH(H72),db_customer!$A$18:$B$29,2,FALSE),\"\")","v":"January"},2017,null,null,null,4754878.5199999996,{"$f":"N72*10%","v":475487.85199999996},{"$f":"SUM(N72:O72)","v":5230366.3719999995}]
[12,"Jatim",138113,"PT KLM","Penagihan","Iuran",17011065,"2017-02-14",{"$f":"IFERROR(VLOOKUP(MONTH(H73),db_customer!$A$18:$B$29,2,FALSE),\"\")","v":"February"},2017,null,null,null,3206479.66,320647.96600000001,3527127.6260000002]
[12,"Jatim",138113,"PT KLM","Penagihan","Iuran",17011126,"2017-03-13",{"$f":"IFERROR(VLOOKUP(MONTH(H74),db_customer!$A$18:$B$29,2,FALSE),\"\")","v":"March"},2017,null,null,null,3741821.25,374182.125,4116003.375]
[12,"Jatim",138113,"PT KLM","Penagihan","Iuran",17011171,"2017-04-12",{"$f":"IFERROR(VLOOKUP(MONTH(H75),db_customer!$A$18:$B$29,2,FALSE),\"\")","v":"April"},2017,null,null,null,2498604.12,249860.41200000001,2748464.5320000001]
[12,"Jatim",138113,"PT KLM","Penagihan","Bunga",17011210,"2017-05-12",{"$f":"IFERROR(VLOOKUP(MONTH(H76),db_customer!$A$18:$B$29,2,FALSE),\"\")","v":"May"},2017,null,null,null,2366177.77,236617.777,2602795.5470000003]
[12,"Jatim",138113,"PT KLM","Penagihan","Bunga",17011252,"2017-06-12",{"$f":"IFERROR(VLOOKUP(MONTH(H77),db_customer!$A$18:$B$29,2,FALSE),\"\")","v":"June"},2017,null,null,null,5182498.45,518249.84500000003,5700748.2949999999]
[12,"Jatim",138113,"PT KLM","Penagihan","Bunga",17011305,"2017-07-14",{"$f":"IFERROR(VLOOKUP(MONTH(H78),db_customer!$A$18:$B$29,2,FALSE),\"\")","v":"July"},2017,null,null,null,8695372,869537.20000000007,9564909.1999999993]
[12,"Jatim",138113,"PT KLM","Penagihan","Bunga",17011356,"2017-08-11",{"$f":"IFERROR(VLOOKUP(MONTH(H79),db_customer!$A$18:$B$29,2,FALSE),\"\")","v":"August"},2017,null,null,null,7908899,790889.9,8699788.9000000004]
[12,"Jatim",138113,"PT KLM","Penagihan","Bunga",17011407,"2017-09-12",{"$f":"IFERROR(VLOOKUP(MONTH(H80),db_customer!$A$18:$B$29,2,FALSE),\"\")","v":"September"},2017,null,null,null,8437985,843798.5,9281783.5]
{"$rows_left_out":51}
{"sheet":"db_customer","index":2,"n_rows":29,"n_cols":5,"rows_kept":29,"cut":false,"hidden":true,"merged":[]}
[]
[]
["Job No","Project Name","Customer No","Client Name","Group"]
[515035,"Hanoman West Coal Mine",600190,"PT CLS","CLS"]
[515036,"Wahana West Coal Mine",387573,"PT WBM","BAYAN"]
[515033,"CLS Plant Hire Agreement",600190,"PT CLS","CLS"]
[515034,"CLS Management Agreement",600190,"PT CLS","CLS"]
[515030,"TCI Satui Interim Works",519949,"PT ARUTMIN","ARUTMIN"]
[513086,"Satui Mine Project",18290,"PT ARUTMIN","ARUTMIN"]
[513087,"Senakin Mine Project",18290,"PT ARUTMIN","ARUTMIN"]
[515001,"KPC Mining Services",18307,"PT KPC","KPC"]
[515021,"TSA - Mining Melak",138111,"PT TSA","BAYAN"]
[515023,"FKP - Mining Melak",138113,"PT FKP","BAYAN"]
[515038,"GBU Coal Mine Project",737777,"PT GBU","GBU"]
[515039,"MSJ Coal Mine Project",388030,"PT MSJ","MSJ"]
[]
[]
[1,"January"]
[2,"February"]
[3,"March"]
[4,"April"]
[5,"May"]
[6,"June"]
[7,"July"]
[8,"August"]
[9,"September"]
[10,"October"]
[11,"November"]
[12,"December"]