tga,sdp5,sxi,rtf,pptx,sgl5,smf5,xls,potm,dbf,xhtml,html,pptm,cdr,svm,wks,ott,ots,svg,otp,lrf,ppotx,pdb,pdf,hwp,oth,otg,otf,pbm,sgf,sdd5,abw,bmp,ppsx,stw,psw,sds5,cmx,pdb_plucker,dxf,stc,sds,sdw5,ppsm,emf,sti,std,sdc,csv,fb2,ppm,xltx,ppt,docm,sdw,sdc5,xltm,fh,sdd_i,pdb_palm,vsd,slk,smf,xlsb,xpm,pcx,xlsm,tiff,pgm,cwk,pcd,xbm,psd,mml,xlsx,mw,sxg,sdd_d,sxd,sxc,docx,wps,docbook,sxm,cgm,wpg,wmf,sxw,sxs,ras,odf,validation,eps,otc,dotx,caolan,odm,wpd,pict,odg,fodg,doc,odc,odb,dotm,vdx,lwp,fodt,odt,ods,fods,fodp,odp,602,met,key,sldm,sda5,sldx,pub
,,0,3,2,,,63,,,,,,0,,0,,1,,0,,0,,,0,,0,0,,,0,,,0,0,,,,,,,,0,,,,,0,0,,,0,15,,0,0,0,,,,0,0,,0,,,0,,,,,,,,6,,0,0,0,18,29,0,,0,,,,,,,1,,,,,,0,0,,3,0,,,1,,0,0,,2805,71,0,0,0,,,,,,,0
,,0,8,2,,,1,,,,,,0,,0,0,0,,0,,0,,,0,,0,0,,,0,1,,0,0,,,,,,,,0,,,,,0,0,,,0,4,,0,0,0,,,,0,0,,0,,,0,,,,,,,,8,,0,0,0,1,36,0,,0,,,,4,,,1,,,,0,,0,0,,3,0,36,,10,,0,0,0,13,5,0,0,0,,,0,,,,0
,,0,9,1,,,1,,,,,,0,,0,0,0,,0,,0,,27,0,,0,0,,,0,0,,0,0,,,,,,,,0,,,,,0,0,,,0,2,,0,0,0,,,,0,0,,0,,,0,,,,,,,,0,,0,0,0,1,31,0,,0,,,,4,,,0,,,,0,,0,0,,0,0,21,,6,,0,0,0,2,3,0,0,0,,,0,,,,0
0,0,0,28,1,0,0,2,0,0,0,0,0,0,0,0,0,0,0,0,0,0,0,29,0,0,0,0,0,0,0,0,0,0,0,0,0,0,0,0,0,0,0,0,0,0,0,0,1,0,0,0,2,0,0,0,0,0,0,0,0,0,0,0,0,0,0,0,0,0,0,0,0,0,0,0,0,0,0,1,32,0,0,0,0,0,0,4,0,0,0,0,0,0,0,,0,0,0,0,0,29,0,9,0,0,0,0,2,5,0,0,0,0,0,0,0,0,0,0
0,0,0,15,0,0,0,0,0,0,0,0,0,0,0,0,0,0,0,0,0,0,0,20,0,0,0,0,0,0,0,0,0,0,0,0,0,0,0,0,0,0,0,0,0,0,0,0,0,0,0,0,1,0,0,0,0,0,0,0,0,0,0,0,0,0,0,0,0,0,0,0,0,0,3,0,0,0,0,0,32,0,0,0,0,0,0,3,0,0,0,0,0,0,0,,0,0,0,0,0,19,0,0,0,0,0,0,51,3,0,0,0,0,0,0,0,0,0,0
0,0,0,15,0,0,0,0,0,0,0,0,0,0,0,0,0,0,0,0,0,0,0,20,0,0,0,0,0,0,0,0,0,0,0,0,0,0,0,0,0,0,0,0,0,0,0,0,0,0,0,0,1,0,0,0,0,0,0,0,0,0,0,0,0,0,0,0,0,0,0,0,0,0,3,0,0,0,0,0,32,0,0,0,0,0,0,3,0,0,0,0,0,0,0,,0,0,0,0,0,19,0,0,0,0,0,0,51,3,0,0,0,0,0,0,0,0,0,0
0,0,0,9,0,0,0,0,0,0,0,0,0,0,0,0,0,0,0,0,0,0,0,18,0,0,0,0,0,0,0,0,0,0,0,0,0,0,0,0,0,0,0,0,0,0,0,0,0,0,0,0,0,0,0,0,0,0,0,0,0,0,0,0,0,0,0,0,0,0,0,0,0,0,3,0,0,0,0,1,32,0,0,0,0,0,0,1,0,0,0,0,0,0,0,,0,0,0,0,0,21,0,9,0,0,0,0,0,3,0,0,0,0,0,0,0,0,0,0
0,0,0,8,0,0,0,0,0,0,0,0,0,0,0,0,0,0,0,0,0,0,0,27,0,0,0,0,0,0,0,0,0,0,0,0,0,0,0,0,0,0,0,0,0,0,0,0,0,0,0,0,0,0,0,0,0,0,0,0,0,0,0,0,0,0,0,0,0,0,0,0,0,0,2,0,0,0,0,0,32,0,0,0,0,0,0,1,0,0,0,0,0,0,0,,0,0,0,0,0,27,0,13,0,0,0,0,0,2,0,0,0,0,0,0,0,0,0,0
0,0,0,9,0,0,0,0,0,0,0,0,0,0,0,0,0,0,0,0,0,0,0,9,0,0,0,0,0,0,0,0,0,0,0,0,0,0,0,0,0,0,0,0,0,0,0,0,0,0,0,0,1,0,0,0,0,0,0,0,0,0,0,0,0,0,0,0,0,0,0,0,0,0,2,0,0,0,0,0,33,0,0,0,0,0,0,1,0,0,0,0,0,0,0,,0,0,0,0,0,17,0,16,0,0,0,0,1,2,0,0,0,0,0,0,0,0,0,0
0,0,0,8,0,0,0,1,0,0,0,0,0,0,0,0,0,0,0,0,0,0,0,16,0,0,0,0,0,0,0,0,0,0,0,0,0,0,0,0,0,0,0,0,0,0,0,0,0,0,0,0,2,0,0,0,0,0,0,0,0,0,0,0,0,0,0,0,0,0,0,0,0,0,2,0,0,0,0,1,34,0,0,0,0,0,0,1,0,0,0,0,0,0,0,,0,0,0,0,0,22,0,2,0,0,0,0,0,1,0,0,0,0,0,0,0,0,0,0
0,0,0,8,0,0,0,0,0,0,0,0,0,0,0,0,0,0,0,0,0,0,0,11,0,0,0,0,0,0,0,0,0,0,0,0,0,0,0,0,0,0,0,0,0,0,0,0,0,0,0,0,2,0,0,0,0,0,0,0,0,0,0,0,0,0,0,0,0,0,0,0,0,0,2,0,0,0,0,0,33,0,0,0,0,0,0,1,0,0,0,0,0,0,0,,0,0,0,0,0,19,0,3,0,0,0,0,0,2,0,0,0,0,0,0,0,0,0,0
0,0,0,8,0,0,0,0,0,0,0,0,0,0,0,0,0,0,0,0,0,0,0,5,0,0,0,0,0,0,0,0,0,0,0,0,0,0,0,0,0,0,0,0,0,0,0,0,0,0,0,0,0,0,0,0,0,0,0,0,0,0,0,0,0,0,0,0,0,0,0,0,0,0,3,0,0,0,0,1,34,0,0,0,0,0,0,,0,0,0,0,0,0,0,,0,0,0,0,0,24,0,0,0,0,0,0,1,1,0,0,1,0,0,0,0,0,0,0
0,0,20,8,0,0,0,0,0,0,0,0,0,0,0,0,0,0,0,2,0,0,0,8,0,0,0,0,0,0,0,0,0,0,0,0,0,0,0,0,0,0,0,0,0,0,0,0,0,0,0,0,0,0,0,0,0,0,0,0,0,0,0,0,0,0,0,0,0,0,0,0,0,0,3,0,0,0,0,1,33,0,0,0,0,0,0,1,0,0,0,0,0,0,0,,0,0,0,0,0,24,0,0,0,0,0,0,0,0,0,0,66,0,0,0,0,0,0,0
0,0,20,9,0,0,0,1,0,0,0,0,0,0,0,0,0,0,0,2,0,0,0,16,0,0,0,0,0,0,0,0,0,0,0,0,0,0,0,0,0,0,0,0,0,0,0,0,0,0,0,0,0,0,0,0,0,0,0,0,0,0,0,0,0,0,0,0,0,0,0,0,0,0,3,0,0,0,0,0,33,0,0,0,0,0,0,1,0,0,0,0,0,0,0,,0,0,0,0,0,25,0,0,0,0,0,0,0,3,0,0,66,0,0,0,0,0,0,0
0,0,0,9,0,0,0,4,0,0,0,0,0,0,0,0,0,0,0,0,0,0,0,8,0,0,0,0,0,0,0,0,0,0,0,0,0,0,0,0,0,0,0,0,0,0,0,0,0,0,0,0,0,0,0,0,0,0,0,0,0,0,0,3,0,0,1,0,0,0,0,0,0,0,7,0,0,0,0,0,34,0,0,0,0,0,0,1,0,0,0,0,0,0,0,,0,0,0,0,0,22,0,0,0,0,0,0,0,3,0,0,0,0,0,0,0,0,0,0
0,0,0,2,0,0,0,1,0,0,0,0,0,0,0,0,0,0,0,0,0,0,0,3,0,0,0,0,0,0,0,0,0,0,0,0,0,0,0,0,0,0,0,0,0,0,0,0,0,0,0,0,0,0,0,0,0,0,0,0,0,0,0,1,0,0,0,0,0,0,0,0,0,0,7,0,0,0,0,0,28,0,0,0,0,0,0,2,0,0,0,0,0,0,0,,0,0,0,0,0,12,0,0,0,0,0,0,1,2,0,0,0,0,0,0,0,0,0,0
0,0,0,2,0,0,0,0,0,0,0,0,0,0,0,0,0,0,0,0,0,0,0,11,0,0,0,0,0,0,0,0,0,0,0,0,0,0,0,0,0,0,0,0,0,0,0,0,0,0,0,0,0,0,0,0,0,0,0,0,0,0,0,2,0,0,0,0,0,0,0,0,0,0,3,0,0,0,0,0,24,0,0,0,0,0,0,1,0,0,0,0,0,0,0,,0,0,0,0,0,23,0,0,0,0,0,0,0,1,0,0,0,0,0,0,0,0,0,0
0,0,0,9,0,0,0,0,0,0,0,0,0,0,0,0,0,0,0,0,0,0,0,1,0,0,0,0,0,0,0,0,0,0,0,0,0,0,0,0,0,0,0,0,0,0,0,0,0,0,0,0,0,0,0,0,0,0,0,0,0,0,0,0,0,0,0,0,0,0,0,0,0,0,3,0,0,0,0,0,23,0,0,0,0,0,0,1,0,0,0,0,0,0,0,,0,0,0,0,0,22,0,1,0,0,0,0,1,3,0,0,1,0,0,0,0,0,0,0
0,0,5,9,0,0,0,1,0,0,0,0,0,0,0,0,0,0,0,0,0,0,0,7,0,0,0,0,0,0,0,0,0,0,0,0,0,0,0,0,0,0,0,0,0,0,0,0,0,0,0,0,306,0,0,0,0,0,0,0,0,0,0,0,0,0,0,0,0,0,0,0,0,0,2,0,0,0,0,0,23,0,0,0,0,0,0,0,0,0,0,0,0,0,0,,0,0,0,0,0,28,0,0,0,0,0,0,0,0,0,0,3,0,0,0,0,0,0,0
0,0,5,9,0,0,0,2,0,0,0,0,0,0,0,0,0,0,0,0,0,0,0,9,0,0,0,0,0,0,0,0,0,0,0,0,0,0,0,0,0,0,0,0,0,0,0,0,0,0,0,0,306,0,0,0,0,0,0,0,0,0,0,0,0,0,0,0,0,0,0,0,0,0,4,0,0,0,0,0,23,0,0,0,0,0,0,1,0,0,0,0,0,0,0,,0,0,0,0,0,28,0,0,0,0,0,0,0,2,0,0,3,0,0,0,0,0,0,0
0,0,0,6,0,0,0,2,0,0,0,0,0,0,0,0,0,0,0,0,0,0,0,15,0,0,0,0,0,0,0,0,0,0,0,0,0,0,0,0,0,0,0,0,0,0,0,0,0,0,0,0,0,0,0,0,0,0,0,0,0,0,0,0,0,0,0,0,0,0,0,0,0,0,4,0,0,0,0,0,23,0,0,0,0,0,0,3,0,0,0,0,0,0,0,,0,0,0,0,0,26,0,0,0,0,0,0,0,0,0,0,0,0,0,0,0,0,0,0
0,0,0,0,0,0,0,1,0,0,0,0,0,0,0,0,0,0,0,0,0,0,0,4,0,0,0,0,0,0,0,0,0,0,0,0,0,0,0,0,0,0,0,0,0,0,0,0,0,0,0,0,0,0,0,0,0,0,0,0,0,0,0,0,0,0,0,0,0,0,0,0,0,0,4,0,0,0,0,2,23,0,0,0,0,0,0,1,0,0,0,0,0,0,0,,0,0,0,0,0,26,0,0,0,0,0,0,0,0,0,0,0,0,0,0,0,0,0,0
0,0,0,0,0,0,0,0,0,0,0,0,0,0,0,0,0,0,0,0,0,0,0,4,0,0,0,0,0,0,0,0,0,0,0,0,0,0,0,0,0,0,0,0,0,0,0,0,0,0,0,0,2,0,0,0,0,0,0,0,0,0,0,0,0,0,0,0,0,0,0,0,0,0,4,0,0,0,0,0,25,0,0,0,0,0,0,1,0,0,0,0,0,0,0,,0,0,0,2,0,26,0,0,0,0,0,0,1,1,0,0,0,0,0,0,0,0,0,0
,,1,49,1,,,4,,,,5,,,,,,,,,,,,4,,,,,,,,,,,,,,,,1,,,,,,,,,,,2,,,,,,,,,,,,,,7,,,51,,,,2,,,6,,,,,,26,,,,,,,1,,1,,,11,,,,,,,,,12,,,,,,,12,12,,,,,,,,,,
,,,49,,,,,,,,5,,,,,,,,,,,,,,,,,,,,,,,,,,,,1,,,,,,,,,,,2,,,,,,,,,,,,,,7,,,51,,,,2,,,1,,,,,,26,,,,,,,1,,1,,,11,,,,,,,,,12,,,,,,,10,,,,1,,,,,,,
,,,49,,,,,,,,6,,,,,,,,,,,,,,,,,,,,,,,,,,,,1,,,,,,,,,,,2,,,,,,,,,,,,,,7,,,51,,,,2,,,1,,,,,,26,,,,,,,1,,1,,,11,,,,,,,,,12,,,,,,,10,,,,1,,,,,,,
,,,49,,,,,,,,5,,,,,1,,,,,,,,,,,,,,,,,,,,,,,,,,,,,,,,,,,,,,,,,,,,,,,,,,,,,,,,,,2,,,,,,26,,,,,,,1,,,,,,,,,,,,,,12,,,,,,,13,,,,2,,,,,,,
,,,,,,,,,,,4,,,,,,,,,,,,,,,,,,,,,,,,,,,,,,,,,,,,,,,,,1,,,,,,,,,,,,,,,,,,,,,,1,,,,,,26,,,,,,,1,,,,,,,,,,,,,,5,,,,,,,10,,,,1,,,,,,,
,,,,,,,,,,,,,,,,,,,,,,,,,,,,,,,,,,,,,,,,,,,,,,,,,,,,,,,,,,,,,,,,,,,,,,,,,,1,,,,,,26,,,,,,,1,,,,,,,,1,,,,,,5,,,,,,,10,1,,,,,,,,,,
,,,,,,,,,,,,,,,,,,,,,,,,,,,,,,,,,,,,,,,,,,,,,,,,,,,,,,,,,,,,,,,,,,,,,,,,,,1,,,,,,26,,,,,,,1,,,,,,,,1,,,,,,5,,,,,,,10,,,,,,,,,,,
